{"text_format":"1","workbook":"xlsx","n_sheets":2,"sheets":["Calendar","Data"],"not_rendered":{"charts":0,"images":0,"macros":1,"external_links":0,"defined_names":0,"comments":0,"pivot_tables":0},"unopened":[],"bounds":{"document_bytes":16777216,"sheet_cells":100000,"rows_first":2000,"rows_last":500,"rows_between":2000,"halvings":0,"cell_chars":16384,"cell_head_chars":4096},"cells_cut":0,"cells_raw":0,"read":"whole","date_system":"1900"}

{"sheet":"Calendar","index":0,"n_rows":29,"n_cols":19,"rows_kept":29,"cut":false,"hidden":false,"merged":[[5,10,5,16]]}
[]
[null,null,"Year:",2010,"Month:",3,"Day:",3]
[]
[null,null,{"$f":"DATE($D$2,$F$2,$H$2)-WEEKDAY(DATE($D$2,$F$2,$H$2),2)+COLUMN(A1)","v":"2010-03-01"},"2010-03-02","2010-03-03","2010-03-04","2010-03-05","2010-03-06","2010-03-07"]
[null,null,"Monday","Tuesday","Wednesday","Thursday","Friday","Saturday","Sunday"]
[null,"00:00-01:00",{"$f":"IF(SUMPRODUCT((Calendar!C$4=Data!$B$2:$B$5000)*(Calendar!$B6=Data!$C$2:$C$5000)*(\"\"<>Data!$D$2:$D$5000))=0,\"\",INDEX(Data!$D$2:$D$5000,SUMPRODUCT((Calendar!C$4=Data!$B$2:$B$5000)*(Calendar!$B6=Data!$C$2:$C$5000)*(ROW($C$2:$C$5000)-1))))","v":""},{"$f":"IF(SUMPRODUCT((Calendar!D$4=Data!$B$2:$B$5000)*(Calendar!$B6=Data!$C$2:$C$5000)*(\"\"<>Data!$D$2:$D$5000))=0,\"\",INDEX(Data!$D$2:$D$5000,SUMPRODUCT((Calendar!D$4=Data!$B$2:$B$5000)*(Calendar!$B6=Data!$C$2:$C$5000)*(ROW($C$2:$C$5000)-1))))","v":""},{"$f":"IF(SUMPRODUCT((Calendar!E$4=Data!$B$2:$B$5000)*(Calendar!$B6=Data!$C$2:$C$5000)*(\"\"<>Data!$D$2:$D$5000))=0,\"\",INDEX(Data!$D$2:$D$5000,SUMPRODUCT((Calendar!E$4=Data!$B$2:$B$5000)*(Calendar!$B6=Data!$C$2:$C$5000)*(ROW($C$2:$C$5000)-1))))","v":""},{"$f":"IF(SUMPRODUCT((Calendar!F$4=Data!$B$2:$B$5000)*(Calendar!$B6=Data!$C$2:$C$5000)*(\"\"<>Data!$D$2:$D$5000))=0,\"\",INDEX(Data!$D$2:$D$5000,SUMPRODUCT((Calendar!F$4=Data!$B$2:$B$5000)*(Calendar!$B6=Data!$C$2:$C$5000)*(ROW($C$2:$C$5000)-1))))","v":""},{"$f":"IF(SUMPRODUCT((Calendar!G$4=Data!$B$2:$B$5000)*(Calendar!$B6=Data!$C$2:$C$5000)*(\"\"<>Data!$D$2:$D$5000))=0,\"\",INDEX(Data!$D$2:$D$5000,SUMPRODUCT((Calendar!G$4=Data!$B$2:$B$5000)*(Calendar!$B6=Data!$C$2:$C$5000)*(ROW($C$2:$C$5000)-1))))","v":""},{"$f":"IF(SUMPRODUCT((Calendar!H$4=Data!$B$2:$B$5000)*(Calendar!$B6=Data!$C$2:$C$5000)*(\"\"<>Data!$D$2:$D$5000))=0,\"\",INDEX(Data!$D$2:$D$5000,SUMPRODUCT((Calendar!H$4=Data!$B$2:$B$5000)*(Calendar!$B6=Data!$C$2:$C$5000)*(ROW($C$2:$C$5000)-1))))","v":""},{"$f":"IF(SUMPRODUCT((Calendar!I$4=Data!$B$2:$B$5000)*(Calendar!$B6=Data!$C$2:$C$5000)*(\"\"<>Data!$D$2:$D$5000))=0,\"\",INDEX(Data!$D$2:$D$5000,SUMPRODUCT((Calendar!I$4=Data!$B$2:$B$5000)*(Calendar!$B6=Data!$C$2:$C$5000)*(ROW($C$2:$C$5000)-1))))","v":""},null,{"$f":"DATE($D$2,$F$2,1)","v":"2010-03-01"}]
[null,"01:00-02:00",{"$f":"IF(SUMPRODUCT((Calendar!C$4=Data!$B$2:$B$5000)*(Calendar!$B7=Data!$C$2:$C$5000)*(\"\"<>Data!$D$2:$D$5000))=0,\"\",INDEX(Data!$D$2:$D$5000,SUMPRODUCT((Calendar!C$4=Data!$B$2:$B$5000)*(Calendar!$B7=Data!$C$2:$C$5000)*(ROW($C$2:$C$5000)-1))))","v":""},{"$f":"IF(SUMPRODUCT((Calendar!D$4=Data!$B$2:$B$5000)*(Calendar!$B7=Data!$C$2:$C$5000)*(\"\"<>Data!$D$2:$D$5000))=0,\"\",INDEX(Data!$D$2:$D$5000,SUMPRODUCT((Calendar!D$4=Data!$B$2:$B$5000)*(Calendar!$B7=Data!$C$2:$C$5000)*(ROW($C$2:$C$5000)-1))))","v":""},{"$f":"IF(SUMPRODUCT((Calendar!E$4=Data!$B$2:$B$5000)*(Calendar!$B7=Data!$C$2:$C$5000)*(\"\"<>Data!$D$2:$D$5000))=0,\"\",INDEX(Data!$D$2:$D$5000,SUMPRODUCT((Calendar!E$4=Data!$B$2:$B$5000)*(Calendar!$B7=Data!$C$2:$C$5000)*(ROW($C$2:$C$5000)-1))))","v":""},{"$f":"IF(SUMPRODUCT((Calendar!F$4=Data!$B$2:$B$5000)*(Calendar!$B7=Data!$C$2:$C$5000)*(\"\"<>Data!$D$2:$D$5000))=0,\"\",INDEX(Data!$D$2:$D$5000,SUMPRODUCT((Calendar!F$4=Data!$B$2:$B$5000)*(Calendar!$B7=Data!$C$2:$C$5000)*(ROW($C$2:$C$5000)-1))))","v":""},{"$f":"IF(SUMPRODUCT((Calendar!G$4=Data!$B$2:$B$5000)*(Calendar!$B7=Data!$C$2:$C$5000)*(\"\"<>Data!$D$2:$D$5000))=0,\"\",INDEX(Data!$D$2:$D$5000,SUMPRODUCT((Calendar!G$4=Data!$B$2:$B$5000)*(Calendar!$B7=Data!$C$2:$C$5000)*(ROW($C$2:$C$5000)-1))))","v":""},{"$f":"IF(SUMPRODUCT((Calendar!H$4=Data!$B$2:$B$5000)*(Calendar!$B7=Data!$C$2:$C$5000)*(\"\"<>Data!$D$2:$D$5000))=0,\"\",INDEX(Data!$D$2:$D$5000,SUMPRODUCT((Calendar!H$4=Data!$B$2:$B$5000)*(Calendar!$B7=Data!$C$2:$C$5000)*(ROW($C$2:$C$5000)-1))))","v":""},{"$f":"IF(SUMPRODUCT((Calendar!I$4=Data!$B$2:$B$5000)*(Calendar!$B7=Data!$C$2:$C$5000)*(\"\"<>Data!$D$2:$D$5000))=0,\"\",INDEX(Data!$D$2:$D$5000,SUMPRODUCT((Calendar!I$4=Data!$B$2:$B$5000)*(Calendar!$B7=Data!$C$2:$C$5000)*(ROW($C$2:$C$5000)-1))))","v":""},null,{"$f":"DATE($D$2,$F$2,1)-WEEKDAY(DATE($D$2,$F$2,1),2)+COLUMN(A1)+(ROW(A1)-1)*7","v":"2010-03-01"},{"$f":"DATE($D$2,$F$2,1)-WEEKDAY(DATE($D$2,$F$2,1),2)+COLUMN(B1)+(ROW(B1)-1)*7","v":"2010-03-02"},"2010-03-03","2010-03-04","2010-03-05","2010-03-06","2010-03-07",null,{"$f":"AND(DAY(TODAY())=K7,DATE(YEAR(TODAY()),MONTH(TODAY()),1)=$K$6)","v":false}]
[null,"02:00-03:00",{"$f":"IF(SUMPRODUCT((Calendar!C$4=Data!$B$2:$B$5000)*(Calendar!$B8=Data!$C$2:$C$5000)*(\"\"<>Data!$D$2:$D$5000))=0,\"\",INDEX(Data!$D$2:$D$5000,SUMPRODUCT((Calendar!C$4=Data!$B$2:$B$5000)*(Calendar!$B8=Data!$C$2:$C$5000)*(ROW($C$2:$C$5000)-1))))","v":""},{"$f":"IF(SUMPRODUCT((Calendar!D$4=Data!$B$2:$B$5000)*(Calendar!$B8=Data!$C$2:$C$5000)*(\"\"<>Data!$D$2:$D$5000))=0,\"\",INDEX(Data!$D$2:$D$5000,SUMPRODUCT((Calendar!D$4=Data!$B$2:$B$5000)*(Calendar!$B8=Data!$C$2:$C$5000)*(ROW($C$2:$C$5000)-1))))","v":""},{"$f":"IF(SUMPRODUCT((Calendar!E$4=Data!$B$2:$B$5000)*(Calendar!$B8=Data!$C$2:$C$5000)*(\"\"<>Data!$D$2:$D$5000))=0,\"\",INDEX(Data!$D$2:$D$5000,SUMPRODUCT((Calendar!E$4=Data!$B$2:$B$5000)*(Calendar!$B8=Data!$C$2:$C$5000)*(ROW($C$2:$C$5000)-1))))","v":""},{"$f":"IF(SUMPRODUCT((Calendar!F$4=Data!$B$2:$B$5000)*(Calendar!$B8=Data!$C$2:$C$5000)*(\"\"<>Data!$D$2:$D$5000))=0,\"\",INDEX(Data!$D$2:$D$5000,SUMPRODUCT((Calendar!F$4=Data!$B$2:$B$5000)*(Calendar!$B8=Data!$C$2:$C$5000)*(ROW($C$2:$C$5000)-1))))","v":""},{"$f":"IF(SUMPRODUCT((Calendar!G$4=Data!$B$2:$B$5000)*(Calendar!$B8=Data!$C$2:$C$5000)*(\"\"<>Data!$D$2:$D$5000))=0,\"\",INDEX(Data!$D$2:$D$5000,SUMPRODUCT((Calendar!G$4=Data!$B$2:$B$5000)*(Calendar!$B8=Data!$C$2:$C$5000)*(ROW($C$2:$C$5000)-1))))","v":""},{"$f":"IF(SUMPRODUCT((Calendar!H$4=Data!$B$2:$B$5000)*(Calendar!$B8=Data!$C$2:$C$5000)*(\"\"<>Data!$D$2:$D$5000))=0,\"\",INDEX(Data!$D$2:$D$5000,SUMPRODUCT((Calendar!H$4=Data!$B$2:$B$5000)*(Calendar!$B8=Data!$C$2:$C$5000)*(ROW($C$2:$C$5000)-1))))","v":""},{"$f":"IF(SUMPRODUCT((Calendar!I$4=Data!$B$2:$B$5000)*(Calendar!$B8=Data!$C$2:$C$5000)*(\"\"<>Data!$D$2:$D$5000))=0,\"\",INDEX(Data!$D$2:$D$5000,SUMPRODUCT((Calendar!I$4=Data!$B$2:$B$5000)*(Calendar!$B8=Data!$C$2:$C$5000)*(ROW($C$2:$C$5000)-1))))","v":""},null,{"$f":"DATE($D$2,$F$2,1)-WEEKDAY(DATE($D$2,$F$2,1),2)+COLUMN(A2)+(ROW(A2)-1)*7","v":"2010-03-08"},{"$f":"DATE($D$2,$F$2,1)-WEEKDAY(DATE($D$2,$F$2,1),2)+COLUMN(B2)+(ROW(B2)-1)*7","v":"2010-03-09"},{"$f":"DATE($D$2,$F$2,1)-WEEKDAY(DATE($D$2,$F$2,1),2)+COLUMN(C2)+(ROW(C2)-1)*7","v":"2010-03-10"},{"$f":"DATE($D$2,$F$2,1)-WEEKDAY(DATE($D$2,$F$2,1),2)+COLUMN(D2)+(ROW(D2)-1)*7","v":"2010-03-11"},{"$f":"DATE($D$2,$F$2,1)-WEEKDAY(DATE($D$2,$F$2,1),2)+COLUMN(E2)+(ROW(E2)-1)*7","v":"2010-03-12"},{"$f":"DATE($D$2,$F$2,1)-WEEKDAY(DATE($D$2,$F$2,1),2)+COLUMN(F2)+(ROW(F2)-1)*7","v":"2010-03-13"},{"$f":"DATE($D$2,$F$2,1)-WEEKDAY(DATE($D$2,$F$2,1),2)+COLUMN(G2)+(ROW(G2)-1)*7","v":"2010-03-14"}]
[null,"03:00-04:00",{"$f":"IF(SUMPRODUCT((Calendar!C$4=Data!$B$2:$B$5000)*(Calendar!$B9=Data!$C$2:$C$5000)*(\"\"<>Data!$D$2:$D$5000))=0,\"\",INDEX(Data!$D$2:$D$5000,SUMPRODUCT((Calendar!C$4=Data!$B$2:$B$5000)*(Calendar!$B9=Data!$C$2:$C$5000)*(ROW($C$2:$C$5000)-1))))","v":""},{"$f":"IF(SUMPRODUCT((Calendar!D$4=Data!$B$2:$B$5000)*(Calendar!$B9=Data!$C$2:$C$5000)*(\"\"<>Data!$D$2:$D$5000))=0,\"\",INDEX(Data!$D$2:$D$5000,SUMPRODUCT((Calendar!D$4=Data!$B$2:$B$5000)*(Calendar!$B9=Data!$C$2:$C$5000)*(ROW($C$2:$C$5000)-1))))","v":""},{"$f":"IF(SUMPRODUCT((Calendar!E$4=Data!$B$2:$B$5000)*(Calendar!$B9=Data!$C$2:$C$5000)*(\"\"<>Data!$D$2:$D$5000))=0,\"\",INDEX(Data!$D$2:$D$5000,SUMPRODUCT((Calendar!E$4=Data!$B$2:$B$5000)*(Calendar!$B9=Data!$C$2:$C$5000)*(ROW($C$2:$C$5000)-1))))","v":""},{"$f":"IF(SUMPRODUCT((Calendar!F$4=Data!$B$2:$B$5000)*(Calendar!$B9=Data!$C$2:$C$5000)*(\"\"<>Data!$D$2:$D$5000))=0,\"\",INDEX(Data!$D$2:$D$5000,SUMPRODUCT((Calendar!F$4=Data!$B$2:$B$5000)*(Calendar!$B9=Data!$C$2:$C$5000)*(ROW($C$2:$C$5000)-1))))","v":""},{"$f":"IF(SUMPRODUCT((Calendar!G$4=Data!$B$2:$B$5000)*(Calendar!$B9=Data!$C$2:$C$5000)*(\"\"<>Data!$D$2:$D$5000))=0,\"\",INDEX(Data!$D$2:$D$5000,SUMPRODUCT((Calendar!G$4=Data!$B$2:$B$5000)*(Calendar!$B9=Data!$C$2:$C$5000)*(ROW($C$2:$C$5000)-1))))","v":""},{"$f":"IF(SUMPRODUCT((Calendar!H$4=Data!$B$2:$B$5000)*(Calendar!$B9=Data!$C$2:$C$5000)*(\"\"<>Data!$D$2:$D$5000))=0,\"\",INDEX(Data!$D$2:$D$5000,SUMPRODUCT((Calendar!H$4=Data!$B$2:$B$5000)*(Calendar!$B9=Data!$C$2:$C$5000)*(ROW($C$2:$C$5000)-1))))","v":""},{"$f":"IF(SUMPRODUCT((Calendar!I$4=Data!$B$2:$B$5000)*(Calendar!$B9=Data!$C$2:$C$5000)*(\"\"<>Data!$D$2:$D$5000))=0,\"\",INDEX(Data!$D$2:$D$5000,SUMPRODUCT((Calendar!I$4=Data!$B$2:$B$5000)*(Calendar!$B9=Data!$C$2:$C$5000)*(ROW($C$2:$C$5000)-1))))","v":""},null,"2010-03-15","2010-03-16","2010-03-17","2010-03-18","2010-03-19","2010-03-20","2010-03-21"]
[null,"04:00-05:00",{"$f":"IF(SUMPRODUCT((Calendar!C$4=Data!$B$2:$B$5000)*(Calendar!$B10=Data!$C$2:$C$5000)*(\"\"<>Data!$D$2:$D$5000))=0,\"\",INDEX(Data!$D$2:$D$5000,SUMPRODUCT((Calendar!C$4=Data!$B$2:$B$5000)*(Calendar!$B10=Data!$C$2:$C$5000)*(ROW($C$2:$C$5000)-1))))","v":""},{"$f":"IF(SUMPRODUCT((Calendar!D$4=Data!$B$2:$B$5000)*(Calendar!$B10=Data!$C$2:$C$5000)*(\"\"<>Data!$D$2:$D$5000))=0,\"\",INDEX(Data!$D$2:$D$5000,SUMPRODUCT((Calendar!D$4=Data!$B$2:$B$5000)*(Calendar!$B10=Data!$C$2:$C$5000)*(ROW($C$2:$C$5000)-1))))","v":""},{"$f":"IF(SUMPRODUCT((Calendar!E$4=Data!$B$2:$B$5000)*(Calendar!$B10=Data!$C$2:$C$5000)*(\"\"<>Data!$D$2:$D$5000))=0,\"\",INDEX(Data!$D$2:$D$5000,SUMPRODUCT((Calendar!E$4=Data!$B$2:$B$5000)*(Calendar!$B10=Data!$C$2:$C$5000)*(ROW($C$2:$C$5000)-1))))","v":""},{"$f":"IF(SUMPRODUCT((Calendar!F$4=Data!$B$2:$B$5000)*(Calendar!$B10=Data!$C$2:$C$5000)*(\"\"<>Data!$D$2:$D$5000))=0,\"\",INDEX(Data!$D$2:$D$5000,SUMPRODUCT((Calendar!F$4=Data!$B$2:$B$5000)*(Calendar!$B10=Data!$C$2:$C$5000)*(ROW($C$2:$C$5000)-1))))","v":""},{"$f":"IF(SUMPRODUCT((Calendar!G$4=Data!$B$2:$B$5000)*(Calendar!$B10=Data!$C$2:$C$5000)*(\"\"<>Data!$D$2:$D$5000))=0,\"\",INDEX(Data!$D$2:$D$5000,SUMPRODUCT((Calendar!G$4=Data!$B$2:$B$5000)*(Calendar!$B10=Data!$C$2:$C$5000)*(ROW($C$2:$C$5000)-1))))","v":""},{"$f":"IF(SUMPRODUCT((Calendar!H$4=Data!$B$2:$B$5000)*(Calendar!$B10=Data!$C$2:$C$5000)*(\"\"<>Data!$D$2:$D$5000))=0,\"\",INDEX(Data!$D$2:$D$5000,SUMPRODUCT((Calendar!H$4=Data!$B$2:$B$5000)*(Calendar!$B10=Data!$C$2:$C$5000)*(ROW($C$2:$C$5000)-1))))","v":""},{"$f":"IF(SUMPRODUCT((Calendar!I$4=Data!$B$2:$B$5000)*(Calendar!$B10=Data!$C$2:$C$5000)*(\"\"<>Data!$D$2:$D$5000))=0,\"\",INDEX(Data!$D$2:$D$5000,SUMPRODUCT((Calendar!I$4=Data!$B$2:$B$5000)*(Calendar!$B10=Data!$C$2:$C$5000)*(ROW($C$2:$C$5000)-1))))","v":""},null,"2010-03-22","2010-03-23","2010-03-24","2010-03-25","2010-03-26","2010-03-27","2010-03-28"]
[null,"05:00-06:00",{"$f":"IF(SUMPRODUCT((Calendar!C$4=Data!$B$2:$B$5000)*(Calendar!$B11=Data!$C$2:$C$5000)*(\"\"<>Data!$D$2:$D$5000))=0,\"\",INDEX(Data!$D$2:$D$5000,SUMPRODUCT((Calendar!C$4=Data!$B$2:$B$5000)*(Calendar!$B11=Data!$C$2:$C$5000)*(ROW($C$2:$C$5000)-1))))","v":""},{"$f":"IF(SUMPRODUCT((Calendar!D$4=Data!$B$2:$B$5000)*(Calendar!$B11=Data!$C$2:$C$5000)*(\"\"<>Data!$D$2:$D$5000))=0,\"\",INDEX(Data!$D$2:$D$5000,SUMPRODUCT((Calendar!D$4=Data!$B$2:$B$5000)*(Calendar!$B11=Data!$C$2:$C$5000)*(ROW($C$2:$C$5000)-1))))","v":""},{"$f":"IF(SUMPRODUCT((Calendar!E$4=Data!$B$2:$B$5000)*(Calendar!$B11=Data!$C$2:$C$5000)*(\"\"<>Data!$D$2:$D$5000))=0,\"\",INDEX(Data!$D$2:$D$5000,SUMPRODUCT((Calendar!E$4=Data!$B$2:$B$5000)*(Calendar!$B11=Data!$C$2:$C$5000)*(ROW($C$2:$C$5000)-1))))","v":""},{"$f":"IF(SUMPRODUCT((Calendar!F$4=Data!$B$2:$B$5000)*(Calendar!$B11=Data!$C$2:$C$5000)*(\"\"<>Data!$D$2:$D$5000))=0,\"\",INDEX(Data!$D$2:$D$5000,SUMPRODUCT((Calendar!F$4=Data!$B$2:$B$5000)*(Calendar!$B11=Data!$C$2:$C$5000)*(ROW($C$2:$C$5000)-1))))","v":""},{"$f":"IF(SUMPRODUCT((Calendar!G$4=Data!$B$2:$B$5000)*(Calendar!$B11=Data!$C$2:$C$5000)*(\"\"<>Data!$D$2:$D$5000))=0,\"\",INDEX(Data!$D$2:$D$5000,SUMPRODUCT((Calendar!G$4=Data!$B$2:$B$5000)*(Calendar!$B11=Data!$C$2:$C$5000)*(ROW($C$2:$C$5000)-1))))","v":""},{"$f":"IF(SUMPRODUCT((Calendar!H$4=Data!$B$2:$B$5000)*(Calendar!$B11=Data!$C$2:$C$5000)*(\"\"<>Data!$D$2:$D$5000))=0,\"\",INDEX(Data!$D$2:$D$5000,SUMPRODUCT((Calendar!H$4=Data!$B$2:$B$5000)*(Calendar!$B11=Data!$C$2:$C$5000)*(ROW($C$2:$C$5000)-1))))","v":""},{"$f":"IF(SUMPRODUCT((Calendar!I$4=Data!$B$2:$B$5000)*(Calendar!$B11=Data!$C$2:$C$5000)*(\"\"<>Data!$D$2:$D$5000))=0,\"\",INDEX(Data!$D$2:$D$5000,SUMPRODUCT((Calendar!I$4=Data!$B$2:$B$5000)*(Calendar!$B11=Data!$C$2:$C$5000)*(ROW($C$2:$C$5000)-1))))","v":""},null,"2010-03-29","2010-03-30","2010-03-31","2010-04-01","2010-04-02","2010-04-03","2010-04-04"]
[null,"06:00-07:00",{"$f":"IF(SUMPRODUCT((Calendar!C$4=Data!$B$2:$B$5000)*(Calendar!$B12=Data!$C$2:$C$5000)*(\"\"<>Data!$D$2:$D$5000))=0,\"\",INDEX(Data!$D$2:$D$5000,SUMPRODUCT((Calendar!C$4=Data!$B$2:$B$5000)*(Calendar!$B12=Data!$C$2:$C$5000)*(ROW($C$2:$C$5000)-1))))","v":""},{"$f":"IF(SUMPRODUCT((Calendar!D$4=Data!$B$2:$B$5000)*(Calendar!$B12=Data!$C$2:$C$5000)*(\"\"<>Data!$D$2:$D$5000))=0,\"\",INDEX(Data!$D$2:$D$5000,SUMPRODUCT((Calendar!D$4=Data!$B$2:$B$5000)*(Calendar!$B12=Data!$C$2:$C$5000)*(ROW($C$2:$C$5000)-1))))","v":""},{"$f":"IF(SUMPRODUCT((Calendar!E$4=Data!$B$2:$B$5000)*(Calendar!$B12=Data!$C$2:$C$5000)*(\"\"<>Data!$D$2:$D$5000))=0,\"\",INDEX(Data!$D$2:$D$5000,SUMPRODUCT((Calendar!E$4=Data!$B$2:$B$5000)*(Calendar!$B12=Data!$C$2:$C$5000)*(ROW($C$2:$C$5000)-1))))","v":""},{"$f":"IF(SUMPRODUCT((Calendar!F$4=Data!$B$2:$B$5000)*(Calendar!$B12=Data!$C$2:$C$5000)*(\"\"<>Data!$D$2:$D$5000))=0,\"\",INDEX(Data!$D$2:$D$5000,SUMPRODUCT((Calendar!F$4=Data!$B$2:$B$5000)*(Calendar!$B12=Data!$C$2:$C$5000)*(ROW($C$2:$C$5000)-1))))","v":""},{"$f":"IF(SUMPRODUCT((Calendar!G$4=Data!$B$2:$B$5000)*(Calendar!$B12=Data!$C$2:$C$5000)*(\"\"<>Data!$D$2:$D$5000))=0,\"\",INDEX(Data!$D$2:$D$5000,SUMPRODUCT((Calendar!G$4=Data!$B$2:$B$5000)*(Calendar!$B12=Data!$C$2:$C$5000)*(ROW($C$2:$C$5000)-1))))","v":""},{"$f":"IF(SUMPRODUCT((Calendar!H$4=Data!$B$2:$B$5000)*(Calendar!$B12=Data!$C$2:$C$5000)*(\"\"<>Data!$D$2:$D$5000))=0,\"\",INDEX(Data!$D$2:$D$5000,SUMPRODUCT((Calendar!H$4=Data!$B$2:$B$5000)*(Calendar!$B12=Data!$C$2:$C$5000)*(ROW($C$2:$C$5000)-1))))","v":""},{"$f":"IF(SUMPRODUCT((Calendar!I$4=Data!$B$2:$B$5000)*(Calendar!$B12=Data!$C$2:$C$5000)*(\"\"<>Data!$D$2:$D$5000))=0,\"\",INDEX(Data!$D$2:$D$5000,SUMPRODUCT((Calendar!I$4=Data!$B$2:$B$5000)*(Calendar!$B12=Data!$C$2:$C$5000)*(ROW($C$2:$C$5000)-1))))","v":""},null,"2010-04-05","2010-04-06","2010-04-07","2010-04-08","2010-04-09","2010-04-10","2010-04-11"]
[null,"07:00-08:00",{"$f":"IF(SUMPRODUCT((Calendar!C$4=Data!$B$2:$B$5000)*(Calendar!$B13=Data!$C$2:$C$5000)*(\"\"<>Data!$D$2:$D$5000))=0,\"\",INDEX(Data!$D$2:$D$5000,SUMPRODUCT((Calendar!C$4=Data!$B$2:$B$5000)*(Calendar!$B13=Data!$C$2:$C$5000)*(ROW($C$2:$C$5000)-1))))","v":""},{"$f":"IF(SUMPRODUCT((Calendar!D$4=Data!$B$2:$B$5000)*(Calendar!$B13=Data!$C$2:$C$5000)*(\"\"<>Data!$D$2:$D$5000))=0,\"\",INDEX(Data!$D$2:$D$5000,SUMPRODUCT((Calendar!D$4=Data!$B$2:$B$5000)*(Calendar!$B13=Data!$C$2:$C$5000)*(ROW($C$2:$C$5000)-1))))","v":""},{"$f":"IF(SUMPRODUCT((Calendar!E$4=Data!$B$2:$B$5000)*(Calendar!$B13=Data!$C$2:$C$5000)*(\"\"<>Data!$D$2:$D$5000))=0,\"\",INDEX(Data!$D$2:$D$5000,SUMPRODUCT((Calendar!E$4=Data!$B$2:$B$5000)*(Calendar!$B13=Data!$C$2:$C$5000)*(ROW($C$2:$C$5000)-1))))","v":""},{"$f":"IF(SUMPRODUCT((Calendar!F$4=Data!$B$2:$B$5000)*(Calendar!$B13=Data!$C$2:$C$5000)*(\"\"<>Data!$D$2:$D$5000))=0,\"\",INDEX(Data!$D$2:$D$5000,SUMPRODUCT((Calendar!F$4=Data!$B$2:$B$5000)*(Calendar!$B13=Data!$C$2:$C$5000)*(ROW($C$2:$C$5000)-1))))","v":""},{"$f":"IF(SUMPRODUCT((Calendar!G$4=Data!$B$2:$B$5000)*(Calendar!$B13=Data!$C$2:$C$5000)*(\"\"<>Data!$D$2:$D$5000))=0,\"\",INDEX(Data!$D$2:$D$5000,SUMPRODUCT((Calendar!G$4=Data!$B$2:$B$5000)*(Calendar!$B13=Data!$C$2:$C$5000)*(ROW($C$2:$C$5000)-1))))","v":""},{"$f":"IF(SUMPRODUCT((Calendar!H$4=Data!$B$2:$B$5000)*(Calendar!$B13=Data!$C$2:$C$5000)*(\"\"<>Data!$D$2:$D$5000))=0,\"\",INDEX(Data!$D$2:$D$5000,SUMPRODUCT((Calendar!H$4=Data!$B$2:$B$5000)*(Calendar!$B13=Data!$C$2:$C$5000)*(ROW($C$2:$C$5000)-1))))","v":""},{"$f":"IF(SUMPRODUCT((Calendar!I$4=Data!$B$2:$B$5000)*(Calendar!$B13=Data!$C$2:$C$5000)*(\"\"<>Data!$D$2:$D$5000))=0,\"\",INDEX(Data!$D$2:$D$5000,SUMPRODUCT((Calendar!I$4=Data!$B$2:$B$5000)*(Calendar!$B13=Data!$C$2:$C$5000)*(ROW($C$2:$C$5000)-1))))","v":""}]
[null,"08:00-09:00",{"$f":"IF(SUMPRODUCT((Calendar!C$4=Data!$B$2:$B$5000)*(Calendar!$B14=Data!$C$2:$C$5000)*(\"\"<>Data!$D$2:$D$5000))=0,\"\",INDEX(Data!$D$2:$D$5000,SUMPRODUCT((Calendar!C$4=Data!$B$2:$B$5000)*(Calendar!$B14=Data!$C$2:$C$5000)*(ROW($C$2:$C$5000)-1))))","v":""},{"$f":"IF(SUMPRODUCT((Calendar!D$4=Data!$B$2:$B$5000)*(Calendar!$B14=Data!$C$2:$C$5000)*(\"\"<>Data!$D$2:$D$5000))=0,\"\",INDEX(Data!$D$2:$D$5000,SUMPRODUCT((Calendar!D$4=Data!$B$2:$B$5000)*(Calendar!$B14=Data!$C$2:$C$5000)*(ROW($C$2:$C$5000)-1))))","v":""},{"$f":"IF(SUMPRODUCT((Calendar!E$4=Data!$B$2:$B$5000)*(Calendar!$B14=Data!$C$2:$C$5000)*(\"\"<>Data!$D$2:$D$5000))=0,\"\",INDEX(Data!$D$2:$D$5000,SUMPRODUCT((Calendar!E$4=Data!$B$2:$B$5000)*(Calendar!$B14=Data!$C$2:$C$5000)*(ROW($C$2:$C$5000)-1))))","v":""},{"$f":"IF(SUMPRODUCT((Calendar!F$4=Data!$B$2:$B$5000)*(Calendar!$B14=Data!$C$2:$C$5000)*(\"\"<>Data!$D$2:$D$5000))=0,\"\",INDEX(Data!$D$2:$D$5000,SUMPRODUCT((Calendar!F$4=Data!$B$2:$B$5000)*(Calendar!$B14=Data!$C$2:$C$5000)*(ROW($C$2:$C$5000)-1))))","v":""},{"$f":"IF(SUMPRODUCT((Calendar!G$4=Data!$B$2:$B$5000)*(Calendar!$B14=Data!$C$2:$C$5000)*(\"\"<>Data!$D$2:$D$5000))=0,\"\",INDEX(Data!$D$2:$D$5000,SUMPRODUCT((Calendar!G$4=Data!$B$2:$B$5000)*(Calendar!$B14=Data!$C$2:$C$5000)*(ROW($C$2:$C$5000)-1))))","v":""},{"$f":"IF(SUMPRODUCT((Calendar!H$4=Data!$B$2:$B$5000)*(Calendar!$B14=Data!$C$2:$C$5000)*(\"\"<>Data!$D$2:$D$5000))=0,\"\",INDEX(Data!$D$2:$D$5000,SUMPRODUCT((Calendar!H$4=Data!$B$2:$B$5000)*(Calendar!$B14=Data!$C$2:$C$5000)*(ROW($C$2:$C$5000)-1))))","v":""},{"$f":"IF(SUMPRODUCT((Calendar!I$4=Data!$B$2:$B$5000)*(Calendar!$B14=Data!$C$2:$C$5000)*(\"\"<>Data!$D$2:$D$5000))=0,\"\",INDEX(Data!$D$2:$D$5000,SUMPRODUCT((Calendar!I$4=Data!$B$2:$B$5000)*(Calendar!$B14=Data!$C$2:$C$5000)*(ROW($C$2:$C$5000)-1))))","v":""},null,"Instructions:"]
[null,"09:00-10:00",{"$f":"IF(SUMPRODUCT((Calendar!C$4=Data!$B$2:$B$5000)*(Calendar!$B15=Data!$C$2:$C$5000)*(\"\"<>Data!$D$2:$D$5000))=0,\"\",INDEX(Data!$D$2:$D$5000,SUMPRODUCT((Calendar!C$4=Data!$B$2:$B$5000)*(Calendar!$B15=Data!$C$2:$C$5000)*(ROW($C$2:$C$5000)-1))))","v":""},{"$f":"IF(SUMPRODUCT((Calendar!D$4=Data!$B$2:$B$5000)*(Calendar!$B15=Data!$C$2:$C$5000)*(\"\"<>Data!$D$2:$D$5000))=0,\"\",INDEX(Data!$D$2:$D$5000,SUMPRODUCT((Calendar!D$4=Data!$B$2:$B$5000)*(Calendar!$B15=Data!$C$2:$C$5000)*(ROW($C$2:$C$5000)-1))))","v":""},{"$f":"IF(SUMPRODUCT((Calendar!E$4=Data!$B$2:$B$5000)*(Calendar!$B15=Data!$C$2:$C$5000)*(\"\"<>Data!$D$2:$D$5000))=0,\"\",INDEX(Data!$D$2:$D$5000,SUMPRODUCT((Calendar!E$4=Data!$B$2:$B$5000)*(Calendar!$B15=Data!$C$2:$C$5000)*(ROW($C$2:$C$5000)-1))))","v":""},{"$f":"IF(SUMPRODUCT((Calendar!F$4=Data!$B$2:$B$5000)*(Calendar!$B15=Data!$C$2:$C$5000)*(\"\"<>Data!$D$2:$D$5000))=0,\"\",INDEX(Data!$D$2:$D$5000,SUMPRODUCT((Calendar!F$4=Data!$B$2:$B$5000)*(Calendar!$B15=Data!$C$2:$C$5000)*(ROW($C$2:$C$5000)-1))))","v":""},{"$f":"IF(SUMPRODUCT((Calendar!G$4=Data!$B$2:$B$5000)*(Calendar!$B15=Data!$C$2:$C$5000)*(\"\"<>Data!$D$2:$D$5000))=0,\"\",INDEX(Data!$D$2:$D$5000,SUMPRODUCT((Calendar!G$4=Data!$B$2:$B$5000)*(Calendar!$B15=Data!$C$2:$C$5000)*(ROW($C$2:$C$5000)-1))))","v":""},{"$f":"IF(SUMPRODUCT((Calendar!H$4=Data!$B$2:$B$5000)*(Calendar!$B15=Data!$C$2:$C$5000)*(\"\"<>Data!$D$2:$D$5000))=0,\"\",INDEX(Data!$D$2:$D$5000,SUMPRODUCT((Calendar!H$4=Data!$B$2:$B$5000)*(Calendar!$B15=Data!$C$2:$C$5000)*(ROW($C$2:$C$5000)-1))))","v":""},{"$f":"IF(SUMPRODUCT((Calendar!I$4=Data!$B$2:$B$5000)*(Calendar!$B15=Data!$C$2:$C$5000)*(\"\"<>Data!$D$2:$D$5000))=0,\"\",INDEX(Data!$D$2:$D$5000,SUMPRODUCT((Calendar!I$4=Data!$B$2:$B$5000)*(Calendar!$B15=Data!$C$2:$C$5000)*(ROW($C$2:$C$5000)-1))))","v":""},null,"Add record"]
{"$rows_left_out":15}
{"sheet":"Data","index":1,"n_rows":29,"n_cols":10,"rows_kept":29,"cut":false,"hidden":false,"merged":[]}
[null,"Date","Time","Title","Text",null,"$H$9","Row:",{"$f":"ROW(INDIRECT(G1))-5","v":4},{"$f":"INDEX(Calendar!C4:I4,Data!I2)","v":"2010-03-06"}]
[null,40234,"10:00-11:00",null,null,null,null,"Column:",{"$f":"COLUMN(INDIRECT(G1))-2","v":6},{"$f":"INDEX(Calendar!$B$6:$B$29,Data!I1)","v":"03:00-04:00"}]
[null,40232,"09:00-10:00","Test Center","Peter",null,null,null,"Title:",{"$f":"IF(IF(ISERROR(MATCH(J1&J2,B2:B5000&C2:C5000,0)),TRUE,INDEX(D2:D5000,MATCH(J1&J2,B2:B5000&C2:C5000,0))=0),\"\",INDEX(D2:D5000,MATCH(J1&J2,B2:B5000&C2:C5000,0)))","v":""}]
[null,40236,"04:00-05:00",null,null,null,null,null,"Text:",{"$f":"IF(IF(ISERROR(MATCH(J1&J2,B2:B5000&C2:C5000,0)),TRUE,INDEX(E2:E5000,MATCH(J1&J2,B2:B5000&C2:C5000,0))=0),\"\",INDEX(E2:E5000,MATCH(J1&J2,B2:B5000&C2:C5000,0)))","v":""}]
[null,40236,"06:00-07:00"]
[null,40236,"09:00-10:00"]
[null,40232,"06:00-07:00"]
[null,40232,"13:00-14:00","Sales Meeting","Folder 2009"]
[null,40235,"13:00-14:00"]
[null,40236,"08:00-09:00"]
[null,40232,"08:00-09:00","Test Center","Peter"]
[null,40232,"14:00-15:00","Sales Meeting"]
[null,40233,"07:00-08:00","Visit Company A"]
[null,40233,"08:00-09:00","Visit Company A"]
[null,40233,"09:00-10:00","Visit Company A"]
{"$rows_left_out":14}