{"text_format":"1","workbook":"xlsx","n_sheets":2,"sheets":["Overview","Calculation"],"not_rendered":{"charts":1,"images":0,"macros":1,"external_links":0,"defined_names":0,"comments":0,"pivot_tables":0},"unopened":[],"bounds":{"document_bytes":16777216,"sheet_cells":100000,"rows_first":2000,"rows_last":500,"rows_between":2000,"halvings":0,"cell_chars":16384,"cell_head_chars":4096},"cells_cut":0,"cells_raw":0,"read":"whole","date_system":"1900"}

{"sheet":"Overview","index":0,"n_rows":69,"n_cols":4,"rows_kept":69,"cut":false,"hidden":false,"merged":[]}
[]
[]
[]
[]
[]
[]
[]
[]
[]
[]
[]
[]
[]
[]
[]
[]
[]
[]
[]
[]
[]
[]
[]
[null,"Date","Action","Price"]
[null,{"$f":"IFERROR(INDEX(Calculation!$D$2:$D$300,SMALL(IF((Calculation!$L$2:$L$300<>\"\")+(Calculation!$M$2:$M$300<>\"\"),MATCH(ROW(Calculation!$L$2:$L$300),ROW(Calculation!$L$2:$L$300)),\"\"),ROW(A1))),\"\")","v":""},{"$f":"IFERROR(IF(INDEX(Calculation!$L$2:$L$300,MATCH(B25,Calculation!$D$2:$D$300,0))=\"\",\"Sell\",\"Buy\"),\"\")","v":""},{"$f":"IFERROR(INDEX(Calculation!$H$2:$H$300,MATCH(B25,Calculation!$D$2:$D$300,0)),\"\")","v":""}]
[null,{"$f":"IFERROR(INDEX(Calculation!$D$2:$D$300,SMALL(IF((Calculation!$L$2:$L$300<>\"\")+(Calculation!$M$2:$M$300<>\"\"),MATCH(ROW(Calculation!$L$2:$L$300),ROW(Calculation!$L$2:$L$300)),\"\"),ROW(A2))),\"\")","v":""},{"$f":"IFERROR(IF(INDEX(Calculation!$L$2:$L$300,MATCH(B26,Calculation!$D$2:$D$300,0))=\"\",\"Sell\",\"Buy\"),\"\")","v":""},{"$f":"IFERROR(INDEX(Calculation!$H$2:$H$300,MATCH(B26,Calculation!$D$2:$D$300,0)),\"\")","v":""}]
[null,{"$f":"IFERROR(INDEX(Calculation!$D$2:$D$300,SMALL(IF((Calculation!$L$2:$L$300<>\"\")+(Calculation!$M$2:$M$300<>\"\"),MATCH(ROW(Calculation!$L$2:$L$300),ROW(Calculation!$L$2:$L$300)),\"\"),ROW(A3))),\"\")","v":""},{"$f":"IFERROR(IF(INDEX(Calculation!$L$2:$L$300,MATCH(B27,Calculation!$D$2:$D$300,0))=\"\",\"Sell\",\"Buy\"),\"\")","v":""},{"$f":"IFERROR(INDEX(Calculation!$H$2:$H$300,MATCH(B27,Calculation!$D$2:$D$300,0)),\"\")","v":""}]
[null,{"$f":"IFERROR(INDEX(Calculation!$D$2:$D$300,SMALL(IF((Calculation!$L$2:$L$300<>\"\")+(Calculation!$M$2:$M$300<>\"\"),MATCH(ROW(Calculation!$L$2:$L$300),ROW(Calculation!$L$2:$L$300)),\"\"),ROW(A4))),\"\")","v":""},{"$f":"IFERROR(IF(INDEX(Calculation!$L$2:$L$300,MATCH(B28,Calculation!$D$2:$D$300,0))=\"\",\"Sell\",\"Buy\"),\"\")","v":""},{"$f":"IFERROR(INDEX(Calculation!$H$2:$H$300,MATCH(B28,Calculation!$D$2:$D$300,0)),\"\")","v":""}]
[null,{"$f":"IFERROR(INDEX(Calculation!$D$2:$D$300,SMALL(IF((Calculation!$L$2:$L$300<>\"\")+(Calculation!$M$2:$M$300<>\"\"),MATCH(ROW(Calculation!$L$2:$L$300),ROW(Calculation!$L$2:$L$300)),\"\"),ROW(A5))),\"\")","v":""},{"$f":"IFERROR(IF(INDEX(Calculation!$L$2:$L$300,MATCH(B29,Calculation!$D$2:$D$300,0))=\"\",\"Sell\",\"Buy\"),\"\")","v":""},{"$f":"IFERROR(INDEX(Calculation!$H$2:$H$300,MATCH(B29,Calculation!$D$2:$D$300,0)),\"\")","v":""}]
[null,{"$f":"IFERROR(INDEX(Calculation!$D$2:$D$300,SMALL(IF((Calculation!$L$2:$L$300<>\"\")+(Calculation!$M$2:$M$300<>\"\"),MATCH(ROW(Calculation!$L$2:$L$300),ROW(Calculation!$L$2:$L$300)),\"\"),ROW(A6))),\"\")","v":""},{"$f":"IFERROR(IF(INDEX(Calculation!$L$2:$L$300,MATCH(B30,Calculation!$D$2:$D$300,0))=\"\",\"Sell\",\"Buy\"),\"\")","v":""},{"$f":"IFERROR(INDEX(Calculation!$H$2:$H$300,MATCH(B30,Calculation!$D$2:$D$300,0)),\"\")","v":""}]
[null,{"$f":"IFERROR(INDEX(Calculation!$D$2:$D$300,SMALL(IF((Calculation!$L$2:$L$300<>\"\")+(Calculation!$M$2:$M$300<>\"\"),MATCH(ROW(Calculation!$L$2:$L$300),ROW(Calculation!$L$2:$L$300)),\"\"),ROW(A7))),\"\")","v":""},{"$f":"IFERROR(IF(INDEX(Calculation!$L$2:$L$300,MATCH(B31,Calculation!$D$2:$D$300,0))=\"\",\"Sell\",\"Buy\"),\"\")","v":""},{"$f":"IFERROR(INDEX(Calculation!$H$2:$H$300,MATCH(B31,Calculation!$D$2:$D$300,0)),\"\")","v":""}]
[null,{"$f":"IFERROR(INDEX(Calculation!$D$2:$D$300,SMALL(IF((Calculation!$L$2:$L$300<>\"\")+(Calculation!$M$2:$M$300<>\"\"),MATCH(ROW(Calculation!$L$2:$L$300),ROW(Calculation!$L$2:$L$300)),\"\"),ROW(A8))),\"\")","v":""},{"$f":"IFERROR(IF(INDEX(Calculation!$L$2:$L$300,MATCH(B32,Calculation!$D$2:$D$300,0))=\"\",\"Sell\",\"Buy\"),\"\")","v":""},{"$f":"IFERROR(INDEX(Calculation!$H$2:$H$300,MATCH(B32,Calculation!$D$2:$D$300,0)),\"\")","v":""}]
[null,{"$f":"IFERROR(INDEX(Calculation!$D$2:$D$300,SMALL(IF((Calculation!$L$2:$L$300<>\"\")+(Calculation!$M$2:$M$300<>\"\"),MATCH(ROW(Calculation!$L$2:$L$300),ROW(Calculation!$L$2:$L$300)),\"\"),ROW(A9))),\"\")","v":""},{"$f":"IFERROR(IF(INDEX(Calculation!$L$2:$L$300,MATCH(B33,Calculation!$D$2:$D$300,0))=\"\",\"Sell\",\"Buy\"),\"\")","v":""},{"$f":"IFERROR(INDEX(Calculation!$H$2:$H$300,MATCH(B33,Calculation!$D$2:$D$300,0)),\"\")","v":""}]
[null,{"$f":"IFERROR(INDEX(Calculation!$D$2:$D$300,SMALL(IF((Calculation!$L$2:$L$300<>\"\")+(Calculation!$M$2:$M$300<>\"\"),MATCH(ROW(Calculation!$L$2:$L$300),ROW(Calculation!$L$2:$L$300)),\"\"),ROW(A10))),\"\")","v":""},{"$f":"IFERROR(IF(INDEX(Calculation!$L$2:$L$300,MATCH(B34,Calculation!$D$2:$D$300,0))=\"\",\"Sell\",\"Buy\"),\"\")","v":""},{"$f":"IFERROR(INDEX(Calculation!$H$2:$H$300,MATCH(B34,Calculation!$D$2:$D$300,0)),\"\")","v":""}]
[null,{"$f":"IFERROR(INDEX(Calculation!$D$2:$D$300,SMALL(IF((Calculation!$L$2:$L$300<>\"\")+(Calculation!$M$2:$M$300<>\"\"),MATCH(ROW(Calculation!$L$2:$L$300),ROW(Calculation!$L$2:$L$300)),\"\"),ROW(A11))),\"\")","v":""},{"$f":"IFERROR(IF(INDEX(Calculation!$L$2:$L$300,MATCH(B35,Calculation!$D$2:$D$300,0))=\"\",\"Sell\",\"Buy\"),\"\")","v":""},{"$f":"IFERROR(INDEX(Calculation!$H$2:$H$300,MATCH(B35,Calculation!$D$2:$D$300,0)),\"\")","v":""}]
[null,{"$f":"IFERROR(INDEX(Calculation!$D$2:$D$300,SMALL(IF((Calculation!$L$2:$L$300<>\"\")+(Calculation!$M$2:$M$300<>\"\"),MATCH(ROW(Calculation!$L$2:$L$300),ROW(Calculation!$L$2:$L$300)),\"\"),ROW(A12))),\"\")","v":""},{"$f":"IFERROR(IF(INDEX(Calculation!$L$2:$L$300,MATCH(B36,Calculation!$D$2:$D$300,0))=\"\",\"Sell\",\"Buy\"),\"\")","v":""},{"$f":"IFERROR(INDEX(Calculation!$H$2:$H$300,MATCH(B36,Calculation!$D$2:$D$300,0)),\"\")","v":""}]
[null,{"$f":"IFERROR(INDEX(Calculation!$D$2:$D$300,SMALL(IF((Calculation!$L$2:$L$300<>\"\")+(Calculation!$M$2:$M$300<>\"\"),MATCH(ROW(Calculation!$L$2:$L$300),ROW(Calculation!$L$2:$L$300)),\"\"),ROW(A13))),\"\")","v":""},{"$f":"IFERROR(IF(INDEX(Calculation!$L$2:$L$300,MATCH(B37,Calculation!$D$2:$D$300,0))=\"\",\"Sell\",\"Buy\"),\"\")","v":""},{"$f":"IFERROR(INDEX(Calculation!$H$2:$H$300,MATCH(B37,Calculation!$D$2:$D$300,0)),\"\")","v":""}]
[null,{"$f":"IFERROR(INDEX(Calculation!$D$2:$D$300,SMALL(IF((Calculation!$L$2:$L$300<>\"\")+(Calculation!$M$2:$M$300<>\"\"),MATCH(ROW(Calculation!$L$2:$L$300),ROW(Calculation!$L$2:$L$300)),\"\"),ROW(A14))),\"\")","v":""},{"$f":"IFERROR(IF(INDEX(Calculation!$L$2:$L$300,MATCH(B38,Calculation!$D$2:$D$300,0))=\"\",\"Sell\",\"Buy\"),\"\")","v":""},{"$f":"IFERROR(INDEX(Calculation!$H$2:$H$300,MATCH(B38,Calculation!$D$2:$D$300,0)),\"\")","v":""}]
[null,{"$f":"IFERROR(INDEX(Calculation!$D$2:$D$300,SMALL(IF((Calculation!$L$2:$L$300<>\"\")+(Calculation!$M$2:$M$300<>\"\"),MATCH(ROW(Calculation!$L$2:$L$300),ROW(Calculation!$L$2:$L$300)),\"\"),ROW(A15))),\"\")","v":""},{"$f":"IFERROR(IF(INDEX(Calculation!$L$2:$L$300,MATCH(B39,Calculation!$D$2:$D$300,0))=\"\",\"Sell\",\"Buy\"),\"\")","v":""},{"$f":"IFERROR(INDEX(Calculation!$H$2:$H$300,MATCH(B39,Calculation!$D$2:$D$300,0)),\"\")","v":""}]
[null,{"$f":"IFERROR(INDEX(Calculation!$D$2:$D$300,SMALL(IF((Calculation!$L$2:$L$300<>\"\")+(Calculation!$M$2:$M$300<>\"\"),MATCH(ROW(Calculation!$L$2:$L$300),ROW(Calculation!$L$2:$L$300)),\"\"),ROW(A16))),\"\")","v":""},{"$f":"IFERROR(IF(INDEX(Calculation!$L$2:$L$300,MATCH(B40,Calculation!$D$2:$D$300,0))=\"\",\"Sell\",\"Buy\"),\"\")","v":""},{"$f":"IFERROR(INDEX(Calculation!$H$2:$H$300,MATCH(B40,Calculation!$D$2:$D$300,0)),\"\")","v":""}]
{"$rows_left_out":30}
{"sheet":"Calculation","index":1,"n_rows":1000,"n_cols":13,"rows_kept":1000,"cut":false,"hidden":false,"merged":[]}
[null,"Year","Month",{"$f":"YahooStockQuotes(2009,9,1,2012,5,31,\"d\",\"^GSPC\")","v":"Date"},"Open","High","Low","Close","Volume","Adj Close","50 day m-avg","Buy","Sell"]
[null,{"$f":"YEAR(D2)","v":2012},{"$f":"IF(TEXT(D2,\"MMM\")=TEXT(D3,\"MMM\"),\"\",TEXT(D2,\"MMM\"))","v":""},"2012-05-31","1313.09","1319.74","1298.90","1310.33","4557620000","1310.33",{"$f":"AVERAGE(H2:H51)","v":{"$error":"#DIV/0!"}},{"$f":"IF((K2-K3>0)*(K3-K4<0),K2,\"\")","v":{"$error":"#DIV/0!"}},{"$f":"IF((K2-K3<0)*(K3-K4>0),K2,\"\")","v":{"$error":"#DIV/0!"}}]
[null,{"$f":"IF(YEAR(D3)=YEAR(D2),\"\",YEAR(D3))","v":""},"","2012-05-30","1331.25","1331.25","1310.76","1313.32","3534290000","1313.32",{"$f":"AVERAGE(H3:H52)","v":{"$error":"#DIV/0!"}},{"$f":"IF((K3-K4>0)*(K4-K5<0),K3,\"\")","v":{"$error":"#DIV/0!"}},{"$f":"IF((K3-K4<0)*(K4-K5>0),K3,\"\")","v":{"$error":"#DIV/0!"}}]
[null,"","","2012-05-29","1318.90","1334.93","1318.90","1332.42","3441640000","1332.42",{"$error":"#DIV/0!"},{"$error":"#DIV/0!"},{"$error":"#DIV/0!"}]
[null,"","","2012-05-25","1320.81","1324.20","1314.23","1317.82","2872660000","1317.82",{"$error":"#DIV/0!"},{"$error":"#DIV/0!"},{"$error":"#DIV/0!"}]
[null,"","","2012-05-24","1318.72","1324.14","1310.50","1320.68","3937670000","1320.68",{"$error":"#DIV/0!"},{"$error":"#DIV/0!"},{"$error":"#DIV/0!"}]
[null,"","","2012-05-23","1316.02","1320.71","1296.53","1318.86","4108330000","1318.86",{"$error":"#DIV/0!"},{"$error":"#DIV/0!"},{"$error":"#DIV/0!"}]
[null,"","","2012-05-22","1316.09","1328.49","1310.04","1316.63","4123680000","1316.63",{"$error":"#DIV/0!"},{"$error":"#DIV/0!"},{"$error":"#DIV/0!"}]
[null,"","","2012-05-21","1295.73","1316.39","1295.73","1315.99","3786750000","1315.99",{"$error":"#DIV/0!"},{"$error":"#DIV/0!"},{"$error":"#DIV/0!"}]
[null,"","","2012-05-18","1305.05","1312.24","1291.98","1295.22","4512470000","1295.22",{"$error":"#DIV/0!"},{"$error":"#DIV/0!"},{"$error":"#DIV/0!"}]
[null,"","","2012-05-17","1324.82","1326.36","1304.86","1304.86","4664280000","1304.86",{"$error":"#DIV/0!"},{"$error":"#DIV/0!"},{"$error":"#DIV/0!"}]
[null,"","","2012-05-16","1330.78","1341.78","1324.79","1324.80","4280420000","1324.80",{"$error":"#DIV/0!"},{"$error":"#DIV/0!"},{"$error":"#DIV/0!"}]
[null,"","","2012-05-15","1338.36","1344.94","1328.41","1330.66","4114040000","1330.66",{"$error":"#DIV/0!"},{"$error":"#DIV/0!"},{"$error":"#DIV/0!"}]
[null,"","","2012-05-14","1351.93","1351.93","1336.61","1338.35","3688120000","1338.35",{"$error":"#DIV/0!"},{"$error":"#DIV/0!"},{"$error":"#DIV/0!"}]
[null,"","","2012-05-11","1358.11","1365.66","1348.89","1353.39","3869070000","1353.39",{"$error":"#DIV/0!"},{"$error":"#DIV/0!"},{"$error":"#DIV/0!"}]
[null,"","","2012-05-10","1354.58","1365.88","1354.58","1357.99","3727990000","1357.99",{"$error":"#DIV/0!"},{"$error":"#DIV/0!"},{"$error":"#DIV/0!"}]
[null,"","","2012-05-09","1363.20","1363.73","1343.13","1354.58","4288540000","1354.58",{"$error":"#DIV/0!"},{"$error":"#DIV/0!"},{"$error":"#DIV/0!"}]
[null,"","","2012-05-08","1369.16","1369.16","1347.75","1363.72","4261670000","1363.72",{"$error":"#DIV/0!"},{"$error":"#DIV/0!"},{"$error":"#DIV/0!"}]
[null,"","","2012-05-07","1368.79","1373.91","1363.94","1369.58","3559390000","1369.58",{"$error":"#DIV/0!"},{"$error":"#DIV/0!"},{"$error":"#DIV/0!"}]
[null,"","","2012-05-04","1391.51","1391.51","1367.96","1369.10","3975140000","1369.10",{"$error":"#DIV/0!"},{"$error":"#DIV/0!"},{"$error":"#DIV/0!"}]
[null,"","","2012-05-03","1402.32","1403.07","1388.71","1391.57","4004910000","1391.57",{"$error":"#DIV/0!"},{"$error":"#DIV/0!"},{"$error":"#DIV/0!"}]
[null,"","","2012-05-02","1405.50","1405.50","1393.92","1402.31","3803860000","1402.31",{"$error":"#DIV/0!"},{"$error":"#DIV/0!"},{"$error":"#DIV/0!"}]
[null,"","maj","2012-05-01","1397.86","1415.32","1395.73","1405.82","3807950000","1405.82",{"$error":"#DIV/0!"},{"$error":"#DIV/0!"},{"$error":"#DIV/0!"}]
[null,"","","2012-04-30","1403.26","1403.26","1394.00","1397.91","3574010000","1397.91",{"$error":"#DIV/0!"},{"$error":"#DIV/0!"},{"$error":"#DIV/0!"}]
[null,"","","2012-04-27","1400.19","1406.64","1397.31","1403.36","3645830000","1403.36",{"$error":"#DIV/0!"},{"$error":"#DIV/0!"},{"$error":"#DIV/0!"}]
[null,"","","2012-04-26","1390.64","1402.09","1387.28","1399.98","4034700000","1399.98",{"$error":"#DIV/0!"},{"$error":"#DIV/0!"},{"$error":"#DIV/0!"}]
[null,"","","2012-04-25","1372.11","1391.37","1372.11","1390.69","3998430000","1390.69",{"$error":"#DIV/0!"},{"$error":"#DIV/0!"},{"$error":"#DIV/0!"}]
[null,"","","2012-04-24","1366.97","1375.57","1366.82","1371.97","3617100000","1371.97",{"$error":"#DIV/0!"},{"$error":"#DIV/0!"},{"$error":"#DIV/0!"}]
[null,"","","2012-04-23","1378.53","1378.53","1358.79","1366.94","3654860000","1366.94",{"$error":"#DIV/0!"},{"$error":"#DIV/0!"},{"$error":"#DIV/0!"}]
[null,"","","2012-04-20","1376.96","1387.40","1376.96","1378.53","3833320000","1378.53",{"$error":"#DIV/0!"},{"$error":"#DIV/0!"},{"$error":"#DIV/0!"}]
[null,"","","2012-04-19","1385.08","1390.46","1370.30","1376.92","4180020000","1376.92",{"$error":"#DIV/0!"},{"$error":"#DIV/0!"},{"$error":"#DIV/0!"}]
[null,"","","2012-04-18","1390.78","1390.78","1383.29","1385.14","3463140000","1385.14",{"$error":"#DIV/0!"},{"$error":"#DIV/0!"},{"$error":"#DIV/0!"}]
[null,"","","2012-04-17","1369.57","1392.76","1369.57","1390.78","3456200000","1390.78",{"$error":"#DIV/0!"},{"$error":"#DIV/0!"},{"$error":"#DIV/0!"}]
[null,"","","2012-04-16","1370.27","1379.66","1365.38","1369.57","3574780000","1369.57",{"$error":"#DIV/0!"},{"$error":"#DIV/0!"},{"$error":"#DIV/0!"}]
[null,"","","2012-04-13","1387.61","1387.61","1369.85","1370.26","3631160000","1370.26",{"$error":"#DIV/0!"},{"$error":"#DIV/0!"},{"$error":"#DIV/0!"}]
[null,"","","2012-04-12","1368.77","1388.13","1368.77","1387.57","3618280000","1387.57",{"$error":"#DIV/0!"},{"$error":"#DIV/0!"},{"$error":"#DIV/0!"}]
[null,"","","2012-04-11","1358.98","1374.71","1358.98","1368.71","3743040000","1368.71",{"$error":"#DIV/0!"},{"$error":"#DIV/0!"},{"$error":"#DIV/0!"}]
[null,"","","2012-04-10","1382.18","1383.01","1357.38","1358.59","4631730000","1358.59",{"$error":"#DIV/0!"},{"$error":"#DIV/0!"},{"$error":"#DIV/0!"}]
[null,"","","2012-04-09","1397.45","1397.45","1378.24","1382.20","3468980000","1382.20",{"$error":"#DIV/0!"},{"$error":"#DIV/0!"},{"$error":"#DIV/0!"}]
[null,"","","2012-04-05","1398.79","1401.60","1392.92","1398.08","3303740000","1398.08",{"$error":"#DIV/0!"},{"$error":"#DIV/0!"},{"$error":"#DIV/0!"}]
{"$rows_left_out":960}