{"text_format":"1","workbook":"xlsx","n_sheets":2,"sheets":["Overview","Calculation"],"not_rendered":{"charts":1,"images":0,"macros":1,"external_links":0,"defined_names":0,"comments":0,"pivot_tables":0},"unopened":[],"bounds":{"document_bytes":16777216,"sheet_cells":100000,"rows_first":2000,"rows_last":500,"rows_between":2000,"halvings":0,"cell_chars":16384,"cell_head_chars":4096},"cells_cut":0,"cells_raw":0,"read":"whole","date_system":"1900"}

{"sheet":"Overview","index":0,"n_rows":69,"n_cols":4,"rows_kept":69,"cut":false,"hidden":false,"merged":[]}
[null,"#1 Moving average:",15]
[null,"#2 Moving average:",7]
[]
[]
[]
[]
[]
[]
[]
[]
[]
[]
[]
[]
[]
[]
[]
[]
[]
[]
[]
[]
[]
[null,"Date","Action","Price"]
[null,{"$f":"IFERROR(INDEX(Calculation!$D$2:$D$247,LARGE(IF((IFERROR(Calculation!$M$2:$M$247,\"\")<>\"\")+(IFERROR(Calculation!$N$2:$N$247,\"\")<>\"\"),MATCH(ROW(Calculation!$M$2:$M$247),ROW(Calculation!$M$2:$M$247)),\"\"),ROW(A1))),\"\")","v":"1994-07-01"},{"$f":"IFERROR(IF(INDEX(Calculation!$M$2:$M$300,MATCH(B25,Calculation!$D$2:$D$300,0))=\"\",\"Sell\",\"Buy\"),\"\")","v":"Sell"},{"$f":"IFERROR(INDEX(Calculation!$H$2:$H$300,MATCH(B25,Calculation!$D$2:$D$300,0)),\"\")","v":458.26}]
[null,{"$f":"IFERROR(INDEX(Calculation!$D$2:$D$247,LARGE(IF((IFERROR(Calculation!$M$2:$M$247,\"\")<>\"\")+(IFERROR(Calculation!$N$2:$N$247,\"\")<>\"\"),MATCH(ROW(Calculation!$M$2:$M$247),ROW(Calculation!$M$2:$M$247)),\"\"),ROW(A2))),\"\")","v":"1995-01-03"},{"$f":"IFERROR(IF(INDEX(Calculation!$M$2:$M$300,MATCH(B26,Calculation!$D$2:$D$300,0))=\"\",\"Sell\",\"Buy\"),\"\")","v":"Buy"},{"$f":"IFERROR(INDEX(Calculation!$H$2:$H$300,MATCH(B26,Calculation!$D$2:$D$300,0)),\"\")","v":470.42}]
[null,{"$f":"IFERROR(INDEX(Calculation!$D$2:$D$247,LARGE(IF((IFERROR(Calculation!$M$2:$M$247,\"\")<>\"\")+(IFERROR(Calculation!$N$2:$N$247,\"\")<>\"\"),MATCH(ROW(Calculation!$M$2:$M$247),ROW(Calculation!$M$2:$M$247)),\"\"),ROW(A3))),\"\")","v":"2000-12-01"},{"$f":"IFERROR(IF(INDEX(Calculation!$M$2:$M$300,MATCH(B27,Calculation!$D$2:$D$300,0))=\"\",\"Sell\",\"Buy\"),\"\")","v":"Sell"},{"$f":"IFERROR(INDEX(Calculation!$H$2:$H$300,MATCH(B27,Calculation!$D$2:$D$300,0)),\"\")","v":1320.28}]
[null,{"$f":"IFERROR(INDEX(Calculation!$D$2:$D$247,LARGE(IF((IFERROR(Calculation!$M$2:$M$247,\"\")<>\"\")+(IFERROR(Calculation!$N$2:$N$247,\"\")<>\"\"),MATCH(ROW(Calculation!$M$2:$M$247),ROW(Calculation!$M$2:$M$247)),\"\"),ROW(A4))),\"\")","v":"2003-08-01"},{"$f":"IFERROR(IF(INDEX(Calculation!$M$2:$M$300,MATCH(B28,Calculation!$D$2:$D$300,0))=\"\",\"Sell\",\"Buy\"),\"\")","v":"Buy"},{"$f":"IFERROR(INDEX(Calculation!$H$2:$H$300,MATCH(B28,Calculation!$D$2:$D$300,0)),\"\")","v":1008.01}]
[null,{"$f":"IFERROR(INDEX(Calculation!$D$2:$D$247,LARGE(IF((IFERROR(Calculation!$M$2:$M$247,\"\")<>\"\")+(IFERROR(Calculation!$N$2:$N$247,\"\")<>\"\"),MATCH(ROW(Calculation!$M$2:$M$247),ROW(Calculation!$M$2:$M$247)),\"\"),ROW(A5))),\"\")","v":"2008-03-03"},{"$f":"IFERROR(IF(INDEX(Calculation!$M$2:$M$300,MATCH(B29,Calculation!$D$2:$D$300,0))=\"\",\"Sell\",\"Buy\"),\"\")","v":"Sell"},{"$f":"IFERROR(INDEX(Calculation!$H$2:$H$300,MATCH(B29,Calculation!$D$2:$D$300,0)),\"\")","v":1322.7}]
[null,{"$f":"IFERROR(INDEX(Calculation!$D$2:$D$247,LARGE(IF((IFERROR(Calculation!$M$2:$M$247,\"\")<>\"\")+(IFERROR(Calculation!$N$2:$N$247,\"\")<>\"\"),MATCH(ROW(Calculation!$M$2:$M$247),ROW(Calculation!$M$2:$M$247)),\"\"),ROW(A6))),\"\")","v":"2009-10-01"},{"$f":"IFERROR(IF(INDEX(Calculation!$M$2:$M$300,MATCH(B30,Calculation!$D$2:$D$300,0))=\"\",\"Sell\",\"Buy\"),\"\")","v":"Buy"},{"$f":"IFERROR(INDEX(Calculation!$H$2:$H$300,MATCH(B30,Calculation!$D$2:$D$300,0)),\"\")","v":1036.19}]
[null,{"$f":"IFERROR(INDEX(Calculation!$D$2:$D$247,LARGE(IF((IFERROR(Calculation!$M$2:$M$247,\"\")<>\"\")+(IFERROR(Calculation!$N$2:$N$247,\"\")<>\"\"),MATCH(ROW(Calculation!$M$2:$M$247),ROW(Calculation!$M$2:$M$247)),\"\"),ROW(A7))),\"\")","v":"2011-12-01"},{"$f":"IFERROR(IF(INDEX(Calculation!$M$2:$M$300,MATCH(B31,Calculation!$D$2:$D$300,0))=\"\",\"Sell\",\"Buy\"),\"\")","v":"Sell"},{"$f":"IFERROR(INDEX(Calculation!$H$2:$H$300,MATCH(B31,Calculation!$D$2:$D$300,0)),\"\")","v":1257.5999999999999}]
[null,{"$f":"IFERROR(INDEX(Calculation!$D$2:$D$247,LARGE(IF((IFERROR(Calculation!$M$2:$M$247,\"\")<>\"\")+(IFERROR(Calculation!$N$2:$N$247,\"\")<>\"\"),MATCH(ROW(Calculation!$M$2:$M$247),ROW(Calculation!$M$2:$M$247)),\"\"),ROW(A8))),\"\")","v":"2012-04-02"},{"$f":"IFERROR(IF(INDEX(Calculation!$M$2:$M$300,MATCH(B32,Calculation!$D$2:$D$300,0))=\"\",\"Sell\",\"Buy\"),\"\")","v":"Buy"},{"$f":"IFERROR(INDEX(Calculation!$H$2:$H$300,MATCH(B32,Calculation!$D$2:$D$300,0)),\"\")","v":1397.91}]
[null,{"$f":"IFERROR(INDEX(Calculation!$D$2:$D$247,LARGE(IF((IFERROR(Calculation!$M$2:$M$247,\"\")<>\"\")+(IFERROR(Calculation!$N$2:$N$247,\"\")<>\"\"),MATCH(ROW(Calculation!$M$2:$M$247),ROW(Calculation!$M$2:$M$247)),\"\"),ROW(A9))),\"\")","v":""},{"$f":"IFERROR(IF(INDEX(Calculation!$M$2:$M$300,MATCH(B33,Calculation!$D$2:$D$300,0))=\"\",\"Sell\",\"Buy\"),\"\")","v":""},{"$f":"IFERROR(INDEX(Calculation!$H$2:$H$300,MATCH(B33,Calculation!$D$2:$D$300,0)),\"\")","v":""}]
[null,{"$f":"IFERROR(INDEX(Calculation!$D$2:$D$247,LARGE(IF((IFERROR(Calculation!$M$2:$M$247,\"\")<>\"\")+(IFERROR(Calculation!$N$2:$N$247,\"\")<>\"\"),MATCH(ROW(Calculation!$M$2:$M$247),ROW(Calculation!$M$2:$M$247)),\"\"),ROW(A10))),\"\")","v":""},{"$f":"IFERROR(IF(INDEX(Calculation!$M$2:$M$300,MATCH(B34,Calculation!$D$2:$D$300,0))=\"\",\"Sell\",\"Buy\"),\"\")","v":""},{"$f":"IFERROR(INDEX(Calculation!$H$2:$H$300,MATCH(B34,Calculation!$D$2:$D$300,0)),\"\")","v":""}]
[null,{"$f":"IFERROR(INDEX(Calculation!$D$2:$D$247,LARGE(IF((IFERROR(Calculation!$M$2:$M$247,\"\")<>\"\")+(IFERROR(Calculation!$N$2:$N$247,\"\")<>\"\"),MATCH(ROW(Calculation!$M$2:$M$247),ROW(Calculation!$M$2:$M$247)),\"\"),ROW(A11))),\"\")","v":""},{"$f":"IFERROR(IF(INDEX(Calculation!$M$2:$M$300,MATCH(B35,Calculation!$D$2:$D$300,0))=\"\",\"Sell\",\"Buy\"),\"\")","v":""},{"$f":"IFERROR(INDEX(Calculation!$H$2:$H$300,MATCH(B35,Calculation!$D$2:$D$300,0)),\"\")","v":""}]
[null,{"$f":"IFERROR(INDEX(Calculation!$D$2:$D$247,LARGE(IF((IFERROR(Calculation!$M$2:$M$247,\"\")<>\"\")+(IFERROR(Calculation!$N$2:$N$247,\"\")<>\"\"),MATCH(ROW(Calculation!$M$2:$M$247),ROW(Calculation!$M$2:$M$247)),\"\"),ROW(A12))),\"\")","v":""},{"$f":"IFERROR(IF(INDEX(Calculation!$M$2:$M$300,MATCH(B36,Calculation!$D$2:$D$300,0))=\"\",\"Sell\",\"Buy\"),\"\")","v":""},{"$f":"IFERROR(INDEX(Calculation!$H$2:$H$300,MATCH(B36,Calculation!$D$2:$D$300,0)),\"\")","v":""}]
[null,{"$f":"IFERROR(INDEX(Calculation!$D$2:$D$247,LARGE(IF((IFERROR(Calculation!$M$2:$M$247,\"\")<>\"\")+(IFERROR(Calculation!$N$2:$N$247,\"\")<>\"\"),MATCH(ROW(Calculation!$M$2:$M$247),ROW(Calculation!$M$2:$M$247)),\"\"),ROW(A13))),\"\")","v":""},{"$f":"IFERROR(IF(INDEX(Calculation!$M$2:$M$300,MATCH(B37,Calculation!$D$2:$D$300,0))=\"\",\"Sell\",\"Buy\"),\"\")","v":""},{"$f":"IFERROR(INDEX(Calculation!$H$2:$H$300,MATCH(B37,Calculation!$D$2:$D$300,0)),\"\")","v":""}]
[null,{"$f":"IFERROR(INDEX(Calculation!$D$2:$D$247,LARGE(IF((IFERROR(Calculation!$M$2:$M$247,\"\")<>\"\")+(IFERROR(Calculation!$N$2:$N$247,\"\")<>\"\"),MATCH(ROW(Calculation!$M$2:$M$247),ROW(Calculation!$M$2:$M$247)),\"\"),ROW(A14))),\"\")","v":""},{"$f":"IFERROR(IF(INDEX(Calculation!$M$2:$M$300,MATCH(B38,Calculation!$D$2:$D$300,0))=\"\",\"Sell\",\"Buy\"),\"\")","v":""},{"$f":"IFERROR(INDEX(Calculation!$H$2:$H$300,MATCH(B38,Calculation!$D$2:$D$300,0)),\"\")","v":""}]
[null,{"$f":"IFERROR(INDEX(Calculation!$D$2:$D$247,LARGE(IF((IFERROR(Calculation!$M$2:$M$247,\"\")<>\"\")+(IFERROR(Calculation!$N$2:$N$247,\"\")<>\"\"),MATCH(ROW(Calculation!$M$2:$M$247),ROW(Calculation!$M$2:$M$247)),\"\"),ROW(A15))),\"\")","v":""},{"$f":"IFERROR(IF(INDEX(Calculation!$M$2:$M$300,MATCH(B39,Calculation!$D$2:$D$300,0))=\"\",\"Sell\",\"Buy\"),\"\")","v":""},{"$f":"IFERROR(INDEX(Calculation!$H$2:$H$300,MATCH(B39,Calculation!$D$2:$D$300,0)),\"\")","v":""}]
[null,{"$f":"IFERROR(INDEX(Calculation!$D$2:$D$247,LARGE(IF((IFERROR(Calculation!$M$2:$M$247,\"\")<>\"\")+(IFERROR(Calculation!$N$2:$N$247,\"\")<>\"\"),MATCH(ROW(Calculation!$M$2:$M$247),ROW(Calculation!$M$2:$M$247)),\"\"),ROW(A16))),\"\")","v":""},{"$f":"IFERROR(IF(INDEX(Calculation!$M$2:$M$300,MATCH(B40,Calculation!$D$2:$D$300,0))=\"\",\"Sell\",\"Buy\"),\"\")","v":""},{"$f":"IFERROR(INDEX(Calculation!$H$2:$H$300,MATCH(B40,Calculation!$D$2:$D$300,0)),\"\")","v":""}]
{"$rows_left_out":30}
{"sheet":"Calculation","index":1,"n_rows":1000,"n_cols":14,"rows_kept":1000,"cut":false,"hidden":false,"merged":[]}
[null,"Year","Month",{"$f":"YahooStockQuotes(1990,9,1,2012,5,31,\"m\",\"^GSPC\")","v":"Date"},"Open","High","Low","Close","Volume","Adj Close","#1 m-avg","#2 m-avg","Buy","Sell"]
[null,{"$f":"IF(YEAR(D2)=YEAR(D3),\"\",YEAR(D2))","v":""},{"$f":"IF(TEXT(D2,\"MMM\")=TEXT(D3,\"MMM\"),\"\",TEXT(D2,\"MMM\"))","v":"maj"},"2012-05-01",1397.86,1415.32,1291.98,1310.33,4158095900,1310.33,{"$f":"AVERAGE(OFFSET(H2,0,0,Overview!$C$1))","v":1303.3686666666665},{"$f":"AVERAGE(OFFSET(H2,0,0,Overview!$C$2))","v":1328.48},{"$f":"IF((L3<K3)*(L2>K2),K2,\"\")","v":""},{"$f":"IF((L3>K3)*(L2<K2),K2,\"\")","v":""}]
[null,{"$f":"IF(YEAR(D3)=YEAR(D4),\"\",YEAR(D3))","v":""},"apr","2012-04-02",1408.47,1422.38,1357.38,1397.91,3916786000,1397.91,{"$f":"AVERAGE(OFFSET(H3,0,0,Overview!$C$1))","v":1304.4946666666665},{"$f":"AVERAGE(OFFSET(H3,0,0,Overview!$C$2))","v":1320.3328571428572},{"$f":"IF((L4<K4)*(L3>K3),K3,\"\")","v":1304.4946666666665},{"$f":"IF((L4>K4)*(L3<K3),K3,\"\")","v":""}]
[null,{"$f":"IF(YEAR(D4)=YEAR(D5),\"\",YEAR(D4))","v":""},"mar","2012-03-01",1365.9,1419.15,1340.03,1408.47,3980752200,1408.47,{"$f":"AVERAGE(OFFSET(H4,0,0,Overview!$C$1))","v":1297.0420000000001},{"$f":"AVERAGE(OFFSET(H4,0,0,Overview!$C$2))","v":1282.2628571428572},"",""]
[null,"","feb","2012-02-01",1312.45,1378.04,1312.45,1365.68,4143404000,1365.68,{"$f":"AVERAGE(OFFSET(H5,0,0,Overview!$C$1))","v":1286.9866666666667},{"$f":"AVERAGE(OFFSET(H5,0,0,Overview!$C$2))","v":1255.18},"",""]
[null,2012,"jan","2012-01-03",1258.8599999999999,1333.47,1258.8599999999999,1312.41,4190155500,1312.41,{"$f":"AVERAGE(OFFSET(H6,0,0,Overview!$C$1))","v":1274.6446666666666},{"$f":"AVERAGE(OFFSET(H6,0,0,Overview!$C$2))","v":1244.6942857142858},"",""]
[null,"","dec","2011-12-01",1246.9100000000001,1269.3699999999999,1202.3699999999999,1257.5999999999999,3667346600,1257.5999999999999,{"$f":"AVERAGE(OFFSET(H7,0,0,Overview!$C$1))","v":1266.0346666666665},{"$f":"AVERAGE(OFFSET(H7,0,0,Overview!$C$2))","v":1245.8700000000001},"",1266.0346666666665]
[null,"","nov","2011-11-01",1251,1277.55,1158.6600000000001,1246.96,4288791900,1246.96,{"$f":"AVERAGE(OFFSET(H8,0,0,Overview!$C$1))","v":1258.2746666666667},{"$f":"AVERAGE(OFFSET(H8,0,0,Overview!$C$2))","v":1258.3842857142859},"",""]
[null,"","okt","2011-10-03",1131.21,1292.6600000000001,1074.77,1253.3,4874946600,1253.3,{"$f":"AVERAGE(OFFSET(H9,0,0,Overview!$C$1))","v":1245.0993333333331},{"$f":"AVERAGE(OFFSET(H9,0,0,Overview!$C$2))","v":1275.0485714285714},"",""]
[null,"","sep","2011-09-01",1219.1199999999999,1229.29,1114.22,1131.42,5104933800,1131.42,{"$f":"AVERAGE(OFFSET(H10,0,0,Overview!$C$1))","v":1234.9859999999999},{"$f":"AVERAGE(OFFSET(H10,0,0,Overview!$C$2))","v":1285.4099999999999},"",""]
[null,"","aug","2011-08-01",1292.5899999999999,1307.3800000000001,1101.54,1218.8900000000001,4942913400,1218.8900000000001,{"$f":"AVERAGE(OFFSET(H11,0,0,Overview!$C$1))","v":1228.2719999999999},{"$f":"AVERAGE(OFFSET(H11,0,0,Overview!$C$2))","v":1313.3814285714286},"",""]
[null,"","jul","2011-07-01",1320.64,1356.48,1282.8599999999999,1292.28,4308168000,1292.28,{"$f":"AVERAGE(OFFSET(H12,0,0,Overview!$C$1))","v":1219.6399999999999},{"$f":"AVERAGE(OFFSET(H12,0,0,Overview!$C$2))","v":1322.9857142857143},"",""]
[null,"","jun","2011-06-01",1345.2,1345.2,1258.07,1320.64,4105601300,1320.64,{"$f":"AVERAGE(OFFSET(H13,0,0,Overview!$C$1))","v":1212.6006666666665},{"$f":"AVERAGE(OFFSET(H13,0,0,Overview!$C$2))","v":1318.037142857143},"",""]
[null,"","maj","2011-05-02",1365.21,1370.58,1311.8,1345.2,4114534200,1345.2,{"$f":"AVERAGE(OFFSET(H14,0,0,Overview!$C$1))","v":1202.52},{"$f":"AVERAGE(OFFSET(H14,0,0,Overview!$C$2))","v":1298.0242857142857},"",""]
[null,"","apr","2011-04-01",1329.48,1364.56,1294.7,1363.61,4042194000,1363.61,{"$f":"AVERAGE(OFFSET(H15,0,0,Overview!$C$1))","v":1186.4726666666668},{"$f":"AVERAGE(OFFSET(H15,0,0,Overview!$C$2))","v":1274.8899999999999},"",""]
[null,"","mar","2011-03-01",1328.64,1332.28,1249.05,1325.83,4046691700,1325.83,{"$f":"AVERAGE(OFFSET(H16,0,0,Overview!$C$1))","v":1167.1566666666668},{"$f":"AVERAGE(OFFSET(H16,0,0,Overview!$C$2))","v":1243.1171428571431},"",""]
[null,"","feb","2011-02-01",1289.1400000000001,1344.07,1289.1400000000001,1327.22,3225297300,1327.22,{"$f":"AVERAGE(OFFSET(H17,0,0,Overview!$C$1))","v":1153.1079999999999},{"$f":"AVERAGE(OFFSET(H17,0,0,Overview!$C$2))","v":1203.6171428571429},"",""]
[null,2011,"jan","2011-01-03",1257.6199999999999,1302.67,1257.6199999999999,1286.1199999999999,4816605000,1286.1199999999999,{"$f":"AVERAGE(OFFSET(H18,0,0,Overview!$C$1))","v":1137.6686666666667},{"$f":"AVERAGE(OFFSET(H18,0,0,Overview!$C$2))","v":1171.3857142857144},"",""]
[null,"","dec","2010-12-01",1186.5999999999999,1262.5999999999999,1186.5999999999999,1257.6400000000001,3762922700,1257.6400000000001,{"$f":"AVERAGE(OFFSET(H19,0,0,Overview!$C$1))","v":1121.0066666666667},{"$f":"AVERAGE(OFFSET(H19,0,0,Overview!$C$2))","v":1134.8985714285714},"",""]
[null,"","nov","2010-11-01",1185.71,1227.08,1173,1180.55,4354084200,1180.55,{"$f":"AVERAGE(OFFSET(H20,0,0,Overview!$C$1))","v":1107.636},{"$f":"AVERAGE(OFFSET(H20,0,0,Overview!$C$2))","v":1110.8657142857144},"",""]
[null,"","okt","2010-10-01",1143.49,1196.1400000000001,1131.8699999999999,1183.26,4432102300,1183.26,{"$f":"AVERAGE(OFFSET(H21,0,0,Overview!$C$1))","v":1096.9739999999997},{"$f":"AVERAGE(OFFSET(H21,0,0,Overview!$C$2))","v":1111.742857142857},"",""]
[null,"","sep","2010-09-01",1049.72,1157.1600000000001,1049.72,1141.2,3993981400,1141.2,{"$f":"AVERAGE(OFFSET(H22,0,0,Overview!$C$1))","v":1083.922},{"$f":"AVERAGE(OFFSET(H22,0,0,Overview!$C$2))","v":1109.767142857143},"",""]
[null,"","aug","2010-08-02",1107.53,1129.24,1039.7,1049.33,4044967700,1049.33,{"$f":"AVERAGE(OFFSET(H23,0,0,Overview!$C$1))","v":1069.1299999999999},{"$f":"AVERAGE(OFFSET(H23,0,0,Overview!$C$2))","v":1104.5228571428572},"",""]
[null,"","jul","2010-07-01",1031.0999999999999,1120.95,1010.91,1101.5999999999999,4704026600,1101.5999999999999,{"$f":"AVERAGE(OFFSET(H24,0,0,Overview!$C$1))","v":1060.4506666666666},{"$f":"AVERAGE(OFFSET(H24,0,0,Overview!$C$2))","v":1108.0285714285715},"",""]
[null,"","jun","2010-06-01",1087.3,1131.23,1028.33,1030.71,5235174000,1030.71,{"$f":"AVERAGE(OFFSET(H25,0,0,Overview!$C$1))","v":1045.1979999999999},{"$f":"AVERAGE(OFFSET(H25,0,0,Overview!$C$2))","v":1109.9571428571428},"",""]
[null,"","maj","2010-05-03",1188.58,1205.1300000000001,1040.78,1089.4100000000001,6626699400,1089.4100000000001,{"$f":"AVERAGE(OFFSET(H26,0,0,Overview!$C$1))","v":1029.6753333333334},{"$f":"AVERAGE(OFFSET(H26,0,0,Overview!$C$2))","v":1119.2314285714285},"",""]
[null,"","apr","2010-04-01",1171.23,1219.8,1170.69,1186.69,5847150900,1186.69,{"$f":"AVERAGE(OFFSET(H27,0,0,Overview!$C$1))","v":1006.054},{"$f":"AVERAGE(OFFSET(H27,0,0,Overview!$C$2))","v":1111.6285714285714},"",""]
[null,"","mar","2010-03-01",1105.3599999999999,1180.69,1105.3599999999999,1169.43,4702951700,1169.43,{"$f":"AVERAGE(OFFSET(H28,0,0,Overview!$C$1))","v":981.99999999999989},{"$f":"AVERAGE(OFFSET(H28,0,0,Overview!$C$2))","v":1093.1128571428569},"",""]
[null,"","feb","2010-02-01",1073.8900000000001,1112.42,1044.5,1104.49,4658238400,1104.49,{"$f":"AVERAGE(OFFSET(H29,0,0,Overview!$C$1))","v":964.25466666666659},{"$f":"AVERAGE(OFFSET(H29,0,0,Overview!$C$2))","v":1071.8542857142859},"",""]
[null,2010,"jan","2010-01-04",1116.56,1150.45,1071.5899999999999,1073.8699999999999,5071601500,1073.8699999999999,{"$f":"AVERAGE(OFFSET(H30,0,0,Overview!$C$1))","v":950.37133333333315},{"$f":"AVERAGE(OFFSET(H30,0,0,Overview!$C$2))","v":1055.1385714285714},"",""]
[null,"","dec","2009-12-01",1098.8900000000001,1130.3800000000001,1085.8900000000001,1115.0999999999999,4163287200,1115.0999999999999,{"$f":"AVERAGE(OFFSET(H31,0,0,Overview!$C$1))","v":943.36333333333334},{"$f":"AVERAGE(OFFSET(H31,0,0,Overview!$C$2))","v":1033.06},"",""]
[null,"","nov","2009-11-02",1036.18,1113.69,1029.3800000000001,1095.6300000000001,4443852500,1095.6300000000001,{"$f":"AVERAGE(OFFSET(H32,0,0,Overview!$C$1))","v":946.78066666666678},{"$f":"AVERAGE(OFFSET(H32,0,0,Overview!$C$2))","v":1005.0657142857143},"",""]
[null,"","okt","2009-10-01",1054.9100000000001,1101.3599999999999,1019.95,1036.19,5451064000,1036.19,{"$f":"AVERAGE(OFFSET(H33,0,0,Overview!$C$1))","v":959.26066666666657},{"$f":"AVERAGE(OFFSET(H33,0,0,Overview!$C$2))","v":973.23428571428565},959.26066666666657,""]
[null,"","sep","2009-09-01",1019.52,1080.1500000000001,991.97,1057.08,5633064200,1057.08,{"$f":"AVERAGE(OFFSET(H34,0,0,Overview!$C$1))","v":974.67333333333352},{"$f":"AVERAGE(OFFSET(H34,0,0,Overview!$C$2))","v":939.18857142857155},"",""]
[null,"","aug","2009-08-03",990.22,1039.47,978.51,1020.62,5764944200,1020.62,{"$f":"AVERAGE(OFFSET(H35,0,0,Overview!$C$1))","v":989.53466666666668},{"$f":"AVERAGE(OFFSET(H35,0,0,Overview!$C$2))","v":893.18999999999994},"",""]
[null,"","jul","2009-07-01",920.82,996.68,869.32,987.48,5080675400,987.48,{"$f":"AVERAGE(OFFSET(H36,0,0,Overview!$C$1))","v":1014.8520000000002},{"$f":"AVERAGE(OFFSET(H36,0,0,Overview!$C$2))","v":865.37},"",""]
[null,"","jun","2009-06-01",923.26,956.23,888.86,919.32,5330941800,919.32,{"$f":"AVERAGE(OFFSET(H37,0,0,Overview!$C$1))","v":1041.3926666666666},{"$f":"AVERAGE(OFFSET(H37,0,0,Overview!$C$2))","v":853.33714285714279},"",""]
[null,"","maj","2009-05-01",872.74,930.17,866.1,919.14,6883268000,919.14,{"$f":"AVERAGE(OFFSET(H38,0,0,Overview!$C$1))","v":1068.2846666666667},{"$f":"AVERAGE(OFFSET(H38,0,0,Overview!$C$2))","v":850.04},"",""]
[null,"","apr","2009-04-01",793.59,888.7,783.32,872.81,6938945600,872.81,{"$f":"AVERAGE(OFFSET(H39,0,0,Overview!$C$1))","v":1095.7173333333335},{"$f":"AVERAGE(OFFSET(H39,0,0,Overview!$C$2))","v":857.12714285714276},"",""]
[null,"","mar","2009-03-02",729.57,832.98,666.79,797.87,7633306300,797.87,{"$f":"AVERAGE(OFFSET(H40,0,0,Overview!$C$1))","v":1129.4333333333334},{"$f":"AVERAGE(OFFSET(H40,0,0,Overview!$C$2))","v":899.06285714285707},"",""]
{"$rows_left_out":960}