{"text_format":"1","workbook":"xlsx","n_sheets":3,"sheets":["Array formula","Filter & Sort","VBA"],"not_rendered":{"charts":0,"images":0,"macros":1,"external_links":0,"defined_names":0,"comments":0,"pivot_tables":0},"unopened":[],"bounds":{"document_bytes":16777216,"sheet_cells":100000,"rows_first":2000,"rows_last":500,"rows_between":2000,"halvings":0,"cell_chars":16384,"cell_head_chars":4096},"cells_cut":0,"cells_raw":0,"read":"whole","date_system":"1900"}

{"sheet":"Array formula","index":0,"n_rows":20,"n_cols":8,"rows_kept":20,"cut":false,"hidden":false,"merged":[]}
[]
[null,"Col B","Col C","Col D",null,"Col B","Col C","Col D"]
[null,"A","RR","AAA",null,{"$f":"INDEX($B$3:$D$20,MATCH(SMALL(COUNTIF($B$3:$B$20,\"<\"&$B$3:$B$20)+COUNTIF($C$3:$C$20,\"<\"&$C$3:$C$20)/(10^CEILING(LOG10(ROWS(Table1[Col B])),1))+COUNTIF($D$3:$D$20,\"<\"&$D$3:$D$20)/(10^CEILING(LOG10(ROWS(Table1[Col B])),1))^2,ROW(B1)),COUNTIF($B$3:$B$20,\"<\"&$B$3:$B$20)+COUNTIF($C$3:$C$20,\"<\"&$C$3:$C$20)/(10^CEILING(LOG10(ROWS(Table1[Col B])),1))+COUNTIF($D$3:$D$20,\"<\"&$D$3:$D$20)/(10^CEILING(LOG10(ROWS(Table1[Col B])),1))^2,0),COLUMN(A1))","v":"A"},{"$f":"INDEX($B$3:$D$20,MATCH(SMALL(COUNTIF($B$3:$B$20,\"<\"&$B$3:$B$20)+COUNTIF($C$3:$C$20,\"<\"&$C$3:$C$20)/(10^CEILING(LOG10(ROWS(Table1[Col B])),1))+COUNTIF($D$3:$D$20,\"<\"&$D$3:$D$20)/(10^CEILING(LOG10(ROWS(Table1[Col B])),1))^2,ROW(C1)),COUNTIF($B$3:$B$20,\"<\"&$B$3:$B$20)+COUNTIF($C$3:$C$20,\"<\"&$C$3:$C$20)/(10^CEILING(LOG10(ROWS(Table1[Col B])),1))+COUNTIF($D$3:$D$20,\"<\"&$D$3:$D$20)/(10^CEILING(LOG10(ROWS(Table1[Col B])),1))^2,0),COLUMN(B1))","v":"AA"},{"$f":"INDEX($B$3:$D$20,MATCH(SMALL(COUNTIF($B$3:$B$20,\"<\"&$B$3:$B$20)+COUNTIF($C$3:$C$20,\"<\"&$C$3:$C$20)/(10^CEILING(LOG10(ROWS(Table1[Col B])),1))+COUNTIF($D$3:$D$20,\"<\"&$D$3:$D$20)/(10^CEILING(LOG10(ROWS(Table1[Col B])),1))^2,ROW(D1)),COUNTIF($B$3:$B$20,\"<\"&$B$3:$B$20)+COUNTIF($C$3:$C$20,\"<\"&$C$3:$C$20)/(10^CEILING(LOG10(ROWS(Table1[Col B])),1))+COUNTIF($D$3:$D$20,\"<\"&$D$3:$D$20)/(10^CEILING(LOG10(ROWS(Table1[Col B])),1))^2,0),COLUMN(C1))","v":"RRR"}]
[null,"A","QQ","BBB",null,{"$f":"INDEX($B$3:$D$20,MATCH(SMALL(COUNTIF($B$3:$B$20,\"<\"&$B$3:$B$20)+COUNTIF($C$3:$C$20,\"<\"&$C$3:$C$20)/(10^CEILING(LOG10(ROWS(Table1[Col B])),1))+COUNTIF($D$3:$D$20,\"<\"&$D$3:$D$20)/(10^CEILING(LOG10(ROWS(Table1[Col B])),1))^2,ROW(B2)),COUNTIF($B$3:$B$20,\"<\"&$B$3:$B$20)+COUNTIF($C$3:$C$20,\"<\"&$C$3:$C$20)/(10^CEILING(LOG10(ROWS(Table1[Col B])),1))+COUNTIF($D$3:$D$20,\"<\"&$D$3:$D$20)/(10^CEILING(LOG10(ROWS(Table1[Col B])),1))^2,0),COLUMN(A2))","v":"A"},{"$f":"INDEX($B$3:$D$20,MATCH(SMALL(COUNTIF($B$3:$B$20,\"<\"&$B$3:$B$20)+COUNTIF($C$3:$C$20,\"<\"&$C$3:$C$20)/(10^CEILING(LOG10(ROWS(Table1[Col B])),1))+COUNTIF($D$3:$D$20,\"<\"&$D$3:$D$20)/(10^CEILING(LOG10(ROWS(Table1[Col B])),1))^2,ROW(C2)),COUNTIF($B$3:$B$20,\"<\"&$B$3:$B$20)+COUNTIF($C$3:$C$20,\"<\"&$C$3:$C$20)/(10^CEILING(LOG10(ROWS(Table1[Col B])),1))+COUNTIF($D$3:$D$20,\"<\"&$D$3:$D$20)/(10^CEILING(LOG10(ROWS(Table1[Col B])),1))^2,0),COLUMN(B2))","v":"BB"},{"$f":"INDEX($B$3:$D$20,MATCH(SMALL(COUNTIF($B$3:$B$20,\"<\"&$B$3:$B$20)+COUNTIF($C$3:$C$20,\"<\"&$C$3:$C$20)/(10^CEILING(LOG10(ROWS(Table1[Col B])),1))+COUNTIF($D$3:$D$20,\"<\"&$D$3:$D$20)/(10^CEILING(LOG10(ROWS(Table1[Col B])),1))^2,ROW(D2)),COUNTIF($B$3:$B$20,\"<\"&$B$3:$B$20)+COUNTIF($C$3:$C$20,\"<\"&$C$3:$C$20)/(10^CEILING(LOG10(ROWS(Table1[Col B])),1))+COUNTIF($D$3:$D$20,\"<\"&$D$3:$D$20)/(10^CEILING(LOG10(ROWS(Table1[Col B])),1))^2,0),COLUMN(C2))","v":"AAA"}]
[null,"A","PP","CCC",null,{"$f":"INDEX($B$3:$D$20,MATCH(SMALL(COUNTIF($B$3:$B$20,\"<\"&$B$3:$B$20)+COUNTIF($C$3:$C$20,\"<\"&$C$3:$C$20)/(10^CEILING(LOG10(ROWS(Table1[Col B])),1))+COUNTIF($D$3:$D$20,\"<\"&$D$3:$D$20)/(10^CEILING(LOG10(ROWS(Table1[Col B])),1))^2,ROW(B3)),COUNTIF($B$3:$B$20,\"<\"&$B$3:$B$20)+COUNTIF($C$3:$C$20,\"<\"&$C$3:$C$20)/(10^CEILING(LOG10(ROWS(Table1[Col B])),1))+COUNTIF($D$3:$D$20,\"<\"&$D$3:$D$20)/(10^CEILING(LOG10(ROWS(Table1[Col B])),1))^2,0),COLUMN(A3))","v":"A"},{"$f":"INDEX($B$3:$D$20,MATCH(SMALL(COUNTIF($B$3:$B$20,\"<\"&$B$3:$B$20)+COUNTIF($C$3:$C$20,\"<\"&$C$3:$C$20)/(10^CEILING(LOG10(ROWS(Table1[Col B])),1))+COUNTIF($D$3:$D$20,\"<\"&$D$3:$D$20)/(10^CEILING(LOG10(ROWS(Table1[Col B])),1))^2,ROW(C3)),COUNTIF($B$3:$B$20,\"<\"&$B$3:$B$20)+COUNTIF($C$3:$C$20,\"<\"&$C$3:$C$20)/(10^CEILING(LOG10(ROWS(Table1[Col B])),1))+COUNTIF($D$3:$D$20,\"<\"&$D$3:$D$20)/(10^CEILING(LOG10(ROWS(Table1[Col B])),1))^2,0),COLUMN(B3))","v":"BB"},{"$f":"INDEX($B$3:$D$20,MATCH(SMALL(COUNTIF($B$3:$B$20,\"<\"&$B$3:$B$20)+COUNTIF($C$3:$C$20,\"<\"&$C$3:$C$20)/(10^CEILING(LOG10(ROWS(Table1[Col B])),1))+COUNTIF($D$3:$D$20,\"<\"&$D$3:$D$20)/(10^CEILING(LOG10(ROWS(Table1[Col B])),1))^2,ROW(D3)),COUNTIF($B$3:$B$20,\"<\"&$B$3:$B$20)+COUNTIF($C$3:$C$20,\"<\"&$C$3:$C$20)/(10^CEILING(LOG10(ROWS(Table1[Col B])),1))+COUNTIF($D$3:$D$20,\"<\"&$D$3:$D$20)/(10^CEILING(LOG10(ROWS(Table1[Col B])),1))^2,0),COLUMN(C3))","v":"QQQ"}]
[null,"A","OO","DDD",null,{"$f":"INDEX($B$3:$D$20,MATCH(SMALL(COUNTIF($B$3:$B$20,\"<\"&$B$3:$B$20)+COUNTIF($C$3:$C$20,\"<\"&$C$3:$C$20)/(10^CEILING(LOG10(ROWS(Table1[Col B])),1))+COUNTIF($D$3:$D$20,\"<\"&$D$3:$D$20)/(10^CEILING(LOG10(ROWS(Table1[Col B])),1))^2,ROW(B4)),COUNTIF($B$3:$B$20,\"<\"&$B$3:$B$20)+COUNTIF($C$3:$C$20,\"<\"&$C$3:$C$20)/(10^CEILING(LOG10(ROWS(Table1[Col B])),1))+COUNTIF($D$3:$D$20,\"<\"&$D$3:$D$20)/(10^CEILING(LOG10(ROWS(Table1[Col B])),1))^2,0),COLUMN(A4))","v":"A"},{"$f":"INDEX($B$3:$D$20,MATCH(SMALL(COUNTIF($B$3:$B$20,\"<\"&$B$3:$B$20)+COUNTIF($C$3:$C$20,\"<\"&$C$3:$C$20)/(10^CEILING(LOG10(ROWS(Table1[Col B])),1))+COUNTIF($D$3:$D$20,\"<\"&$D$3:$D$20)/(10^CEILING(LOG10(ROWS(Table1[Col B])),1))^2,ROW(C4)),COUNTIF($B$3:$B$20,\"<\"&$B$3:$B$20)+COUNTIF($C$3:$C$20,\"<\"&$C$3:$C$20)/(10^CEILING(LOG10(ROWS(Table1[Col B])),1))+COUNTIF($D$3:$D$20,\"<\"&$D$3:$D$20)/(10^CEILING(LOG10(ROWS(Table1[Col B])),1))^2,0),COLUMN(B4))","v":"CC"},{"$f":"INDEX($B$3:$D$20,MATCH(SMALL(COUNTIF($B$3:$B$20,\"<\"&$B$3:$B$20)+COUNTIF($C$3:$C$20,\"<\"&$C$3:$C$20)/(10^CEILING(LOG10(ROWS(Table1[Col B])),1))+COUNTIF($D$3:$D$20,\"<\"&$D$3:$D$20)/(10^CEILING(LOG10(ROWS(Table1[Col B])),1))^2,ROW(D4)),COUNTIF($B$3:$B$20,\"<\"&$B$3:$B$20)+COUNTIF($C$3:$C$20,\"<\"&$C$3:$C$20)/(10^CEILING(LOG10(ROWS(Table1[Col B])),1))+COUNTIF($D$3:$D$20,\"<\"&$D$3:$D$20)/(10^CEILING(LOG10(ROWS(Table1[Col B])),1))^2,0),COLUMN(C4))","v":"PPP"}]
[null,"A","NN","EEE",null,{"$f":"INDEX($B$3:$D$20,MATCH(SMALL(COUNTIF($B$3:$B$20,\"<\"&$B$3:$B$20)+COUNTIF($C$3:$C$20,\"<\"&$C$3:$C$20)/(10^CEILING(LOG10(ROWS(Table1[Col B])),1))+COUNTIF($D$3:$D$20,\"<\"&$D$3:$D$20)/(10^CEILING(LOG10(ROWS(Table1[Col B])),1))^2,ROW(B5)),COUNTIF($B$3:$B$20,\"<\"&$B$3:$B$20)+COUNTIF($C$3:$C$20,\"<\"&$C$3:$C$20)/(10^CEILING(LOG10(ROWS(Table1[Col B])),1))+COUNTIF($D$3:$D$20,\"<\"&$D$3:$D$20)/(10^CEILING(LOG10(ROWS(Table1[Col B])),1))^2,0),COLUMN(A5))","v":"A"},{"$f":"INDEX($B$3:$D$20,MATCH(SMALL(COUNTIF($B$3:$B$20,\"<\"&$B$3:$B$20)+COUNTIF($C$3:$C$20,\"<\"&$C$3:$C$20)/(10^CEILING(LOG10(ROWS(Table1[Col B])),1))+COUNTIF($D$3:$D$20,\"<\"&$D$3:$D$20)/(10^CEILING(LOG10(ROWS(Table1[Col B])),1))^2,ROW(C5)),COUNTIF($B$3:$B$20,\"<\"&$B$3:$B$20)+COUNTIF($C$3:$C$20,\"<\"&$C$3:$C$20)/(10^CEILING(LOG10(ROWS(Table1[Col B])),1))+COUNTIF($D$3:$D$20,\"<\"&$D$3:$D$20)/(10^CEILING(LOG10(ROWS(Table1[Col B])),1))^2,0),COLUMN(B5))","v":"EE"},{"$f":"INDEX($B$3:$D$20,MATCH(SMALL(COUNTIF($B$3:$B$20,\"<\"&$B$3:$B$20)+COUNTIF($C$3:$C$20,\"<\"&$C$3:$C$20)/(10^CEILING(LOG10(ROWS(Table1[Col B])),1))+COUNTIF($D$3:$D$20,\"<\"&$D$3:$D$20)/(10^CEILING(LOG10(ROWS(Table1[Col B])),1))^2,ROW(D5)),COUNTIF($B$3:$B$20,\"<\"&$B$3:$B$20)+COUNTIF($C$3:$C$20,\"<\"&$C$3:$C$20)/(10^CEILING(LOG10(ROWS(Table1[Col B])),1))+COUNTIF($D$3:$D$20,\"<\"&$D$3:$D$20)/(10^CEILING(LOG10(ROWS(Table1[Col B])),1))^2,0),COLUMN(C5))","v":"NNN"}]
[null,"A","MM","FFF",null,{"$f":"INDEX($B$3:$D$20,MATCH(SMALL(COUNTIF($B$3:$B$20,\"<\"&$B$3:$B$20)+COUNTIF($C$3:$C$20,\"<\"&$C$3:$C$20)/(10^CEILING(LOG10(ROWS(Table1[Col B])),1))+COUNTIF($D$3:$D$20,\"<\"&$D$3:$D$20)/(10^CEILING(LOG10(ROWS(Table1[Col B])),1))^2,ROW(B6)),COUNTIF($B$3:$B$20,\"<\"&$B$3:$B$20)+COUNTIF($C$3:$C$20,\"<\"&$C$3:$C$20)/(10^CEILING(LOG10(ROWS(Table1[Col B])),1))+COUNTIF($D$3:$D$20,\"<\"&$D$3:$D$20)/(10^CEILING(LOG10(ROWS(Table1[Col B])),1))^2,0),COLUMN(A6))","v":"A"},{"$f":"INDEX($B$3:$D$20,MATCH(SMALL(COUNTIF($B$3:$B$20,\"<\"&$B$3:$B$20)+COUNTIF($C$3:$C$20,\"<\"&$C$3:$C$20)/(10^CEILING(LOG10(ROWS(Table1[Col B])),1))+COUNTIF($D$3:$D$20,\"<\"&$D$3:$D$20)/(10^CEILING(LOG10(ROWS(Table1[Col B])),1))^2,ROW(C6)),COUNTIF($B$3:$B$20,\"<\"&$B$3:$B$20)+COUNTIF($C$3:$C$20,\"<\"&$C$3:$C$20)/(10^CEILING(LOG10(ROWS(Table1[Col B])),1))+COUNTIF($D$3:$D$20,\"<\"&$D$3:$D$20)/(10^CEILING(LOG10(ROWS(Table1[Col B])),1))^2,0),COLUMN(B6))","v":"FF"},{"$f":"INDEX($B$3:$D$20,MATCH(SMALL(COUNTIF($B$3:$B$20,\"<\"&$B$3:$B$20)+COUNTIF($C$3:$C$20,\"<\"&$C$3:$C$20)/(10^CEILING(LOG10(ROWS(Table1[Col B])),1))+COUNTIF($D$3:$D$20,\"<\"&$D$3:$D$20)/(10^CEILING(LOG10(ROWS(Table1[Col B])),1))^2,ROW(D6)),COUNTIF($B$3:$B$20,\"<\"&$B$3:$B$20)+COUNTIF($C$3:$C$20,\"<\"&$C$3:$C$20)/(10^CEILING(LOG10(ROWS(Table1[Col B])),1))+COUNTIF($D$3:$D$20,\"<\"&$D$3:$D$20)/(10^CEILING(LOG10(ROWS(Table1[Col B])),1))^2,0),COLUMN(C6))","v":"MMM"}]
[null,"A","LL","GGG",null,{"$f":"INDEX($B$3:$D$20,MATCH(SMALL(COUNTIF($B$3:$B$20,\"<\"&$B$3:$B$20)+COUNTIF($C$3:$C$20,\"<\"&$C$3:$C$20)/(10^CEILING(LOG10(ROWS(Table1[Col B])),1))+COUNTIF($D$3:$D$20,\"<\"&$D$3:$D$20)/(10^CEILING(LOG10(ROWS(Table1[Col B])),1))^2,ROW(B7)),COUNTIF($B$3:$B$20,\"<\"&$B$3:$B$20)+COUNTIF($C$3:$C$20,\"<\"&$C$3:$C$20)/(10^CEILING(LOG10(ROWS(Table1[Col B])),1))+COUNTIF($D$3:$D$20,\"<\"&$D$3:$D$20)/(10^CEILING(LOG10(ROWS(Table1[Col B])),1))^2,0),COLUMN(A7))","v":"A"},{"$f":"INDEX($B$3:$D$20,MATCH(SMALL(COUNTIF($B$3:$B$20,\"<\"&$B$3:$B$20)+COUNTIF($C$3:$C$20,\"<\"&$C$3:$C$20)/(10^CEILING(LOG10(ROWS(Table1[Col B])),1))+COUNTIF($D$3:$D$20,\"<\"&$D$3:$D$20)/(10^CEILING(LOG10(ROWS(Table1[Col B])),1))^2,ROW(C7)),COUNTIF($B$3:$B$20,\"<\"&$B$3:$B$20)+COUNTIF($C$3:$C$20,\"<\"&$C$3:$C$20)/(10^CEILING(LOG10(ROWS(Table1[Col B])),1))+COUNTIF($D$3:$D$20,\"<\"&$D$3:$D$20)/(10^CEILING(LOG10(ROWS(Table1[Col B])),1))^2,0),COLUMN(B7))","v":"GG"},{"$f":"INDEX($B$3:$D$20,MATCH(SMALL(COUNTIF($B$3:$B$20,\"<\"&$B$3:$B$20)+COUNTIF($C$3:$C$20,\"<\"&$C$3:$C$20)/(10^CEILING(LOG10(ROWS(Table1[Col B])),1))+COUNTIF($D$3:$D$20,\"<\"&$D$3:$D$20)/(10^CEILING(LOG10(ROWS(Table1[Col B])),1))^2,ROW(D7)),COUNTIF($B$3:$B$20,\"<\"&$B$3:$B$20)+COUNTIF($C$3:$C$20,\"<\"&$C$3:$C$20)/(10^CEILING(LOG10(ROWS(Table1[Col B])),1))+COUNTIF($D$3:$D$20,\"<\"&$D$3:$D$20)/(10^CEILING(LOG10(ROWS(Table1[Col B])),1))^2,0),COLUMN(C7))","v":"LLL"}]
[null,"A","KK","HHH",null,{"$f":"INDEX($B$3:$D$20,MATCH(SMALL(COUNTIF($B$3:$B$20,\"<\"&$B$3:$B$20)+COUNTIF($C$3:$C$20,\"<\"&$C$3:$C$20)/(10^CEILING(LOG10(ROWS(Table1[Col B])),1))+COUNTIF($D$3:$D$20,\"<\"&$D$3:$D$20)/(10^CEILING(LOG10(ROWS(Table1[Col B])),1))^2,ROW(B8)),COUNTIF($B$3:$B$20,\"<\"&$B$3:$B$20)+COUNTIF($C$3:$C$20,\"<\"&$C$3:$C$20)/(10^CEILING(LOG10(ROWS(Table1[Col B])),1))+COUNTIF($D$3:$D$20,\"<\"&$D$3:$D$20)/(10^CEILING(LOG10(ROWS(Table1[Col B])),1))^2,0),COLUMN(A8))","v":"A"},{"$f":"INDEX($B$3:$D$20,MATCH(SMALL(COUNTIF($B$3:$B$20,\"<\"&$B$3:$B$20)+COUNTIF($C$3:$C$20,\"<\"&$C$3:$C$20)/(10^CEILING(LOG10(ROWS(Table1[Col B])),1))+COUNTIF($D$3:$D$20,\"<\"&$D$3:$D$20)/(10^CEILING(LOG10(ROWS(Table1[Col B])),1))^2,ROW(C8)),COUNTIF($B$3:$B$20,\"<\"&$B$3:$B$20)+COUNTIF($C$3:$C$20,\"<\"&$C$3:$C$20)/(10^CEILING(LOG10(ROWS(Table1[Col B])),1))+COUNTIF($D$3:$D$20,\"<\"&$D$3:$D$20)/(10^CEILING(LOG10(ROWS(Table1[Col B])),1))^2,0),COLUMN(B8))","v":"HH"},{"$f":"INDEX($B$3:$D$20,MATCH(SMALL(COUNTIF($B$3:$B$20,\"<\"&$B$3:$B$20)+COUNTIF($C$3:$C$20,\"<\"&$C$3:$C$20)/(10^CEILING(LOG10(ROWS(Table1[Col B])),1))+COUNTIF($D$3:$D$20,\"<\"&$D$3:$D$20)/(10^CEILING(LOG10(ROWS(Table1[Col B])),1))^2,ROW(D8)),COUNTIF($B$3:$B$20,\"<\"&$B$3:$B$20)+COUNTIF($C$3:$C$20,\"<\"&$C$3:$C$20)/(10^CEILING(LOG10(ROWS(Table1[Col B])),1))+COUNTIF($D$3:$D$20,\"<\"&$D$3:$D$20)/(10^CEILING(LOG10(ROWS(Table1[Col B])),1))^2,0),COLUMN(C8))","v":"KKK"}]
[null,"A","JJ","III",null,{"$f":"INDEX($B$3:$D$20,MATCH(SMALL(COUNTIF($B$3:$B$20,\"<\"&$B$3:$B$20)+COUNTIF($C$3:$C$20,\"<\"&$C$3:$C$20)/(10^CEILING(LOG10(ROWS(Table1[Col B])),1))+COUNTIF($D$3:$D$20,\"<\"&$D$3:$D$20)/(10^CEILING(LOG10(ROWS(Table1[Col B])),1))^2,ROW(B9)),COUNTIF($B$3:$B$20,\"<\"&$B$3:$B$20)+COUNTIF($C$3:$C$20,\"<\"&$C$3:$C$20)/(10^CEILING(LOG10(ROWS(Table1[Col B])),1))+COUNTIF($D$3:$D$20,\"<\"&$D$3:$D$20)/(10^CEILING(LOG10(ROWS(Table1[Col B])),1))^2,0),COLUMN(A9))","v":"A"},{"$f":"INDEX($B$3:$D$20,MATCH(SMALL(COUNTIF($B$3:$B$20,\"<\"&$B$3:$B$20)+COUNTIF($C$3:$C$20,\"<\"&$C$3:$C$20)/(10^CEILING(LOG10(ROWS(Table1[Col B])),1))+COUNTIF($D$3:$D$20,\"<\"&$D$3:$D$20)/(10^CEILING(LOG10(ROWS(Table1[Col B])),1))^2,ROW(C9)),COUNTIF($B$3:$B$20,\"<\"&$B$3:$B$20)+COUNTIF($C$3:$C$20,\"<\"&$C$3:$C$20)/(10^CEILING(LOG10(ROWS(Table1[Col B])),1))+COUNTIF($D$3:$D$20,\"<\"&$D$3:$D$20)/(10^CEILING(LOG10(ROWS(Table1[Col B])),1))^2,0),COLUMN(B9))","v":"II"},{"$f":"INDEX($B$3:$D$20,MATCH(SMALL(COUNTIF($B$3:$B$20,\"<\"&$B$3:$B$20)+COUNTIF($C$3:$C$20,\"<\"&$C$3:$C$20)/(10^CEILING(LOG10(ROWS(Table1[Col B])),1))+COUNTIF($D$3:$D$20,\"<\"&$D$3:$D$20)/(10^CEILING(LOG10(ROWS(Table1[Col B])),1))^2,ROW(D9)),COUNTIF($B$3:$B$20,\"<\"&$B$3:$B$20)+COUNTIF($C$3:$C$20,\"<\"&$C$3:$C$20)/(10^CEILING(LOG10(ROWS(Table1[Col B])),1))+COUNTIF($D$3:$D$20,\"<\"&$D$3:$D$20)/(10^CEILING(LOG10(ROWS(Table1[Col B])),1))^2,0),COLUMN(C9))","v":"JJJ"}]
[null,"A","II","JJJ",null,{"$f":"INDEX($B$3:$D$20,MATCH(SMALL(COUNTIF($B$3:$B$20,\"<\"&$B$3:$B$20)+COUNTIF($C$3:$C$20,\"<\"&$C$3:$C$20)/(10^CEILING(LOG10(ROWS(Table1[Col B])),1))+COUNTIF($D$3:$D$20,\"<\"&$D$3:$D$20)/(10^CEILING(LOG10(ROWS(Table1[Col B])),1))^2,ROW(B10)),COUNTIF($B$3:$B$20,\"<\"&$B$3:$B$20)+COUNTIF($C$3:$C$20,\"<\"&$C$3:$C$20)/(10^CEILING(LOG10(ROWS(Table1[Col B])),1))+COUNTIF($D$3:$D$20,\"<\"&$D$3:$D$20)/(10^CEILING(LOG10(ROWS(Table1[Col B])),1))^2,0),COLUMN(A10))","v":"A"},{"$f":"INDEX($B$3:$D$20,MATCH(SMALL(COUNTIF($B$3:$B$20,\"<\"&$B$3:$B$20)+COUNTIF($C$3:$C$20,\"<\"&$C$3:$C$20)/(10^CEILING(LOG10(ROWS(Table1[Col B])),1))+COUNTIF($D$3:$D$20,\"<\"&$D$3:$D$20)/(10^CEILING(LOG10(ROWS(Table1[Col B])),1))^2,ROW(C10)),COUNTIF($B$3:$B$20,\"<\"&$B$3:$B$20)+COUNTIF($C$3:$C$20,\"<\"&$C$3:$C$20)/(10^CEILING(LOG10(ROWS(Table1[Col B])),1))+COUNTIF($D$3:$D$20,\"<\"&$D$3:$D$20)/(10^CEILING(LOG10(ROWS(Table1[Col B])),1))^2,0),COLUMN(B10))","v":"JJ"},{"$f":"INDEX($B$3:$D$20,MATCH(SMALL(COUNTIF($B$3:$B$20,\"<\"&$B$3:$B$20)+COUNTIF($C$3:$C$20,\"<\"&$C$3:$C$20)/(10^CEILING(LOG10(ROWS(Table1[Col B])),1))+COUNTIF($D$3:$D$20,\"<\"&$D$3:$D$20)/(10^CEILING(LOG10(ROWS(Table1[Col B])),1))^2,ROW(D10)),COUNTIF($B$3:$B$20,\"<\"&$B$3:$B$20)+COUNTIF($C$3:$C$20,\"<\"&$C$3:$C$20)/(10^CEILING(LOG10(ROWS(Table1[Col B])),1))+COUNTIF($D$3:$D$20,\"<\"&$D$3:$D$20)/(10^CEILING(LOG10(ROWS(Table1[Col B])),1))^2,0),COLUMN(C10))","v":"III"}]
[null,"A","HH","KKK",null,{"$f":"INDEX($B$3:$D$20,MATCH(SMALL(COUNTIF($B$3:$B$20,\"<\"&$B$3:$B$20)+COUNTIF($C$3:$C$20,\"<\"&$C$3:$C$20)/(10^CEILING(LOG10(ROWS(Table1[Col B])),1))+COUNTIF($D$3:$D$20,\"<\"&$D$3:$D$20)/(10^CEILING(LOG10(ROWS(Table1[Col B])),1))^2,ROW(B11)),COUNTIF($B$3:$B$20,\"<\"&$B$3:$B$20)+COUNTIF($C$3:$C$20,\"<\"&$C$3:$C$20)/(10^CEILING(LOG10(ROWS(Table1[Col B])),1))+COUNTIF($D$3:$D$20,\"<\"&$D$3:$D$20)/(10^CEILING(LOG10(ROWS(Table1[Col B])),1))^2,0),COLUMN(A11))","v":"A"},{"$f":"INDEX($B$3:$D$20,MATCH(SMALL(COUNTIF($B$3:$B$20,\"<\"&$B$3:$B$20)+COUNTIF($C$3:$C$20,\"<\"&$C$3:$C$20)/(10^CEILING(LOG10(ROWS(Table1[Col B])),1))+COUNTIF($D$3:$D$20,\"<\"&$D$3:$D$20)/(10^CEILING(LOG10(ROWS(Table1[Col B])),1))^2,ROW(C11)),COUNTIF($B$3:$B$20,\"<\"&$B$3:$B$20)+COUNTIF($C$3:$C$20,\"<\"&$C$3:$C$20)/(10^CEILING(LOG10(ROWS(Table1[Col B])),1))+COUNTIF($D$3:$D$20,\"<\"&$D$3:$D$20)/(10^CEILING(LOG10(ROWS(Table1[Col B])),1))^2,0),COLUMN(B11))","v":"KK"},{"$f":"INDEX($B$3:$D$20,MATCH(SMALL(COUNTIF($B$3:$B$20,\"<\"&$B$3:$B$20)+COUNTIF($C$3:$C$20,\"<\"&$C$3:$C$20)/(10^CEILING(LOG10(ROWS(Table1[Col B])),1))+COUNTIF($D$3:$D$20,\"<\"&$D$3:$D$20)/(10^CEILING(LOG10(ROWS(Table1[Col B])),1))^2,ROW(D11)),COUNTIF($B$3:$B$20,\"<\"&$B$3:$B$20)+COUNTIF($C$3:$C$20,\"<\"&$C$3:$C$20)/(10^CEILING(LOG10(ROWS(Table1[Col B])),1))+COUNTIF($D$3:$D$20,\"<\"&$D$3:$D$20)/(10^CEILING(LOG10(ROWS(Table1[Col B])),1))^2,0),COLUMN(C11))","v":"HHH"}]
[null,"A","GG","LLL",null,{"$f":"INDEX($B$3:$D$20,MATCH(SMALL(COUNTIF($B$3:$B$20,\"<\"&$B$3:$B$20)+COUNTIF($C$3:$C$20,\"<\"&$C$3:$C$20)/(10^CEILING(LOG10(ROWS(Table1[Col B])),1))+COUNTIF($D$3:$D$20,\"<\"&$D$3:$D$20)/(10^CEILING(LOG10(ROWS(Table1[Col B])),1))^2,ROW(B12)),COUNTIF($B$3:$B$20,\"<\"&$B$3:$B$20)+COUNTIF($C$3:$C$20,\"<\"&$C$3:$C$20)/(10^CEILING(LOG10(ROWS(Table1[Col B])),1))+COUNTIF($D$3:$D$20,\"<\"&$D$3:$D$20)/(10^CEILING(LOG10(ROWS(Table1[Col B])),1))^2,0),COLUMN(A12))","v":"A"},{"$f":"INDEX($B$3:$D$20,MATCH(SMALL(COUNTIF($B$3:$B$20,\"<\"&$B$3:$B$20)+COUNTIF($C$3:$C$20,\"<\"&$C$3:$C$20)/(10^CEILING(LOG10(ROWS(Table1[Col B])),1))+COUNTIF($D$3:$D$20,\"<\"&$D$3:$D$20)/(10^CEILING(LOG10(ROWS(Table1[Col B])),1))^2,ROW(C12)),COUNTIF($B$3:$B$20,\"<\"&$B$3:$B$20)+COUNTIF($C$3:$C$20,\"<\"&$C$3:$C$20)/(10^CEILING(LOG10(ROWS(Table1[Col B])),1))+COUNTIF($D$3:$D$20,\"<\"&$D$3:$D$20)/(10^CEILING(LOG10(ROWS(Table1[Col B])),1))^2,0),COLUMN(B12))","v":"LL"},{"$f":"INDEX($B$3:$D$20,MATCH(SMALL(COUNTIF($B$3:$B$20,\"<\"&$B$3:$B$20)+COUNTIF($C$3:$C$20,\"<\"&$C$3:$C$20)/(10^CEILING(LOG10(ROWS(Table1[Col B])),1))+COUNTIF($D$3:$D$20,\"<\"&$D$3:$D$20)/(10^CEILING(LOG10(ROWS(Table1[Col B])),1))^2,ROW(D12)),COUNTIF($B$3:$B$20,\"<\"&$B$3:$B$20)+COUNTIF($C$3:$C$20,\"<\"&$C$3:$C$20)/(10^CEILING(LOG10(ROWS(Table1[Col B])),1))+COUNTIF($D$3:$D$20,\"<\"&$D$3:$D$20)/(10^CEILING(LOG10(ROWS(Table1[Col B])),1))^2,0),COLUMN(C12))","v":"GGG"}]
[null,"A","FF","MMM",null,{"$f":"INDEX($B$3:$D$20,MATCH(SMALL(COUNTIF($B$3:$B$20,\"<\"&$B$3:$B$20)+COUNTIF($C$3:$C$20,\"<\"&$C$3:$C$20)/(10^CEILING(LOG10(ROWS(Table1[Col B])),1))+COUNTIF($D$3:$D$20,\"<\"&$D$3:$D$20)/(10^CEILING(LOG10(ROWS(Table1[Col B])),1))^2,ROW(B13)),COUNTIF($B$3:$B$20,\"<\"&$B$3:$B$20)+COUNTIF($C$3:$C$20,\"<\"&$C$3:$C$20)/(10^CEILING(LOG10(ROWS(Table1[Col B])),1))+COUNTIF($D$3:$D$20,\"<\"&$D$3:$D$20)/(10^CEILING(LOG10(ROWS(Table1[Col B])),1))^2,0),COLUMN(A13))","v":"A"},{"$f":"INDEX($B$3:$D$20,MATCH(SMALL(COUNTIF($B$3:$B$20,\"<\"&$B$3:$B$20)+COUNTIF($C$3:$C$20,\"<\"&$C$3:$C$20)/(10^CEILING(LOG10(ROWS(Table1[Col B])),1))+COUNTIF($D$3:$D$20,\"<\"&$D$3:$D$20)/(10^CEILING(LOG10(ROWS(Table1[Col B])),1))^2,ROW(C13)),COUNTIF($B$3:$B$20,\"<\"&$B$3:$B$20)+COUNTIF($C$3:$C$20,\"<\"&$C$3:$C$20)/(10^CEILING(LOG10(ROWS(Table1[Col B])),1))+COUNTIF($D$3:$D$20,\"<\"&$D$3:$D$20)/(10^CEILING(LOG10(ROWS(Table1[Col B])),1))^2,0),COLUMN(B13))","v":"MM"},{"$f":"INDEX($B$3:$D$20,MATCH(SMALL(COUNTIF($B$3:$B$20,\"<\"&$B$3:$B$20)+COUNTIF($C$3:$C$20,\"<\"&$C$3:$C$20)/(10^CEILING(LOG10(ROWS(Table1[Col B])),1))+COUNTIF($D$3:$D$20,\"<\"&$D$3:$D$20)/(10^CEILING(LOG10(ROWS(Table1[Col B])),1))^2,ROW(D13)),COUNTIF($B$3:$B$20,\"<\"&$B$3:$B$20)+COUNTIF($C$3:$C$20,\"<\"&$C$3:$C$20)/(10^CEILING(LOG10(ROWS(Table1[Col B])),1))+COUNTIF($D$3:$D$20,\"<\"&$D$3:$D$20)/(10^CEILING(LOG10(ROWS(Table1[Col B])),1))^2,0),COLUMN(C13))","v":"FFF"}]
[null,"A","EE","NNN",null,{"$f":"INDEX($B$3:$D$20,MATCH(SMALL(COUNTIF($B$3:$B$20,\"<\"&$B$3:$B$20)+COUNTIF($C$3:$C$20,\"<\"&$C$3:$C$20)/(10^CEILING(LOG10(ROWS(Table1[Col B])),1))+COUNTIF($D$3:$D$20,\"<\"&$D$3:$D$20)/(10^CEILING(LOG10(ROWS(Table1[Col B])),1))^2,ROW(B14)),COUNTIF($B$3:$B$20,\"<\"&$B$3:$B$20)+COUNTIF($C$3:$C$20,\"<\"&$C$3:$C$20)/(10^CEILING(LOG10(ROWS(Table1[Col B])),1))+COUNTIF($D$3:$D$20,\"<\"&$D$3:$D$20)/(10^CEILING(LOG10(ROWS(Table1[Col B])),1))^2,0),COLUMN(A14))","v":"A"},{"$f":"INDEX($B$3:$D$20,MATCH(SMALL(COUNTIF($B$3:$B$20,\"<\"&$B$3:$B$20)+COUNTIF($C$3:$C$20,\"<\"&$C$3:$C$20)/(10^CEILING(LOG10(ROWS(Table1[Col B])),1))+COUNTIF($D$3:$D$20,\"<\"&$D$3:$D$20)/(10^CEILING(LOG10(ROWS(Table1[Col B])),1))^2,ROW(C14)),COUNTIF($B$3:$B$20,\"<\"&$B$3:$B$20)+COUNTIF($C$3:$C$20,\"<\"&$C$3:$C$20)/(10^CEILING(LOG10(ROWS(Table1[Col B])),1))+COUNTIF($D$3:$D$20,\"<\"&$D$3:$D$20)/(10^CEILING(LOG10(ROWS(Table1[Col B])),1))^2,0),COLUMN(B14))","v":"NN"},{"$f":"INDEX($B$3:$D$20,MATCH(SMALL(COUNTIF($B$3:$B$20,\"<\"&$B$3:$B$20)+COUNTIF($C$3:$C$20,\"<\"&$C$3:$C$20)/(10^CEILING(LOG10(ROWS(Table1[Col B])),1))+COUNTIF($D$3:$D$20,\"<\"&$D$3:$D$20)/(10^CEILING(LOG10(ROWS(Table1[Col B])),1))^2,ROW(D14)),COUNTIF($B$3:$B$20,\"<\"&$B$3:$B$20)+COUNTIF($C$3:$C$20,\"<\"&$C$3:$C$20)/(10^CEILING(LOG10(ROWS(Table1[Col B])),1))+COUNTIF($D$3:$D$20,\"<\"&$D$3:$D$20)/(10^CEILING(LOG10(ROWS(Table1[Col B])),1))^2,0),COLUMN(C14))","v":"EEE"}]
[null,"A","BB","AAA",null,{"$f":"INDEX($B$3:$D$20,MATCH(SMALL(COUNTIF($B$3:$B$20,\"<\"&$B$3:$B$20)+COUNTIF($C$3:$C$20,\"<\"&$C$3:$C$20)/(10^CEILING(LOG10(ROWS(Table1[Col B])),1))+COUNTIF($D$3:$D$20,\"<\"&$D$3:$D$20)/(10^CEILING(LOG10(ROWS(Table1[Col B])),1))^2,ROW(B15)),COUNTIF($B$3:$B$20,\"<\"&$B$3:$B$20)+COUNTIF($C$3:$C$20,\"<\"&$C$3:$C$20)/(10^CEILING(LOG10(ROWS(Table1[Col B])),1))+COUNTIF($D$3:$D$20,\"<\"&$D$3:$D$20)/(10^CEILING(LOG10(ROWS(Table1[Col B])),1))^2,0),COLUMN(A15))","v":"A"},{"$f":"INDEX($B$3:$D$20,MATCH(SMALL(COUNTIF($B$3:$B$20,\"<\"&$B$3:$B$20)+COUNTIF($C$3:$C$20,\"<\"&$C$3:$C$20)/(10^CEILING(LOG10(ROWS(Table1[Col B])),1))+COUNTIF($D$3:$D$20,\"<\"&$D$3:$D$20)/(10^CEILING(LOG10(ROWS(Table1[Col B])),1))^2,ROW(C15)),COUNTIF($B$3:$B$20,\"<\"&$B$3:$B$20)+COUNTIF($C$3:$C$20,\"<\"&$C$3:$C$20)/(10^CEILING(LOG10(ROWS(Table1[Col B])),1))+COUNTIF($D$3:$D$20,\"<\"&$D$3:$D$20)/(10^CEILING(LOG10(ROWS(Table1[Col B])),1))^2,0),COLUMN(B15))","v":"OO"},{"$f":"INDEX($B$3:$D$20,MATCH(SMALL(COUNTIF($B$3:$B$20,\"<\"&$B$3:$B$20)+COUNTIF($C$3:$C$20,\"<\"&$C$3:$C$20)/(10^CEILING(LOG10(ROWS(Table1[Col B])),1))+COUNTIF($D$3:$D$20,\"<\"&$D$3:$D$20)/(10^CEILING(LOG10(ROWS(Table1[Col B])),1))^2,ROW(D15)),COUNTIF($B$3:$B$20,\"<\"&$B$3:$B$20)+COUNTIF($C$3:$C$20,\"<\"&$C$3:$C$20)/(10^CEILING(LOG10(ROWS(Table1[Col B])),1))+COUNTIF($D$3:$D$20,\"<\"&$D$3:$D$20)/(10^CEILING(LOG10(ROWS(Table1[Col B])),1))^2,0),COLUMN(C15))","v":"DDD"}]
[null,"A","CC","PPP",null,{"$f":"INDEX($B$3:$D$20,MATCH(SMALL(COUNTIF($B$3:$B$20,\"<\"&$B$3:$B$20)+COUNTIF($C$3:$C$20,\"<\"&$C$3:$C$20)/(10^CEILING(LOG10(ROWS(Table1[Col B])),1))+COUNTIF($D$3:$D$20,\"<\"&$D$3:$D$20)/(10^CEILING(LOG10(ROWS(Table1[Col B])),1))^2,ROW(B16)),COUNTIF($B$3:$B$20,\"<\"&$B$3:$B$20)+COUNTIF($C$3:$C$20,\"<\"&$C$3:$C$20)/(10^CEILING(LOG10(ROWS(Table1[Col B])),1))+COUNTIF($D$3:$D$20,\"<\"&$D$3:$D$20)/(10^CEILING(LOG10(ROWS(Table1[Col B])),1))^2,0),COLUMN(A16))","v":"A"},{"$f":"INDEX($B$3:$D$20,MATCH(SMALL(COUNTIF($B$3:$B$20,\"<\"&$B$3:$B$20)+COUNTIF($C$3:$C$20,\"<\"&$C$3:$C$20)/(10^CEILING(LOG10(ROWS(Table1[Col B])),1))+COUNTIF($D$3:$D$20,\"<\"&$D$3:$D$20)/(10^CEILING(LOG10(ROWS(Table1[Col B])),1))^2,ROW(C16)),COUNTIF($B$3:$B$20,\"<\"&$B$3:$B$20)+COUNTIF($C$3:$C$20,\"<\"&$C$3:$C$20)/(10^CEILING(LOG10(ROWS(Table1[Col B])),1))+COUNTIF($D$3:$D$20,\"<\"&$D$3:$D$20)/(10^CEILING(LOG10(ROWS(Table1[Col B])),1))^2,0),COLUMN(B16))","v":"PP"},{"$f":"INDEX($B$3:$D$20,MATCH(SMALL(COUNTIF($B$3:$B$20,\"<\"&$B$3:$B$20)+COUNTIF($C$3:$C$20,\"<\"&$C$3:$C$20)/(10^CEILING(LOG10(ROWS(Table1[Col B])),1))+COUNTIF($D$3:$D$20,\"<\"&$D$3:$D$20)/(10^CEILING(LOG10(ROWS(Table1[Col B])),1))^2,ROW(D16)),COUNTIF($B$3:$B$20,\"<\"&$B$3:$B$20)+COUNTIF($C$3:$C$20,\"<\"&$C$3:$C$20)/(10^CEILING(LOG10(ROWS(Table1[Col B])),1))+COUNTIF($D$3:$D$20,\"<\"&$D$3:$D$20)/(10^CEILING(LOG10(ROWS(Table1[Col B])),1))^2,0),COLUMN(C16))","v":"CCC"}]
[null,"A","BB","QQQ",null,{"$f":"INDEX($B$3:$D$20,MATCH(SMALL(COUNTIF($B$3:$B$20,\"<\"&$B$3:$B$20)+COUNTIF($C$3:$C$20,\"<\"&$C$3:$C$20)/(10^CEILING(LOG10(ROWS(Table1[Col B])),1))+COUNTIF($D$3:$D$20,\"<\"&$D$3:$D$20)/(10^CEILING(LOG10(ROWS(Table1[Col B])),1))^2,ROW(B17)),COUNTIF($B$3:$B$20,\"<\"&$B$3:$B$20)+COUNTIF($C$3:$C$20,\"<\"&$C$3:$C$20)/(10^CEILING(LOG10(ROWS(Table1[Col B])),1))+COUNTIF($D$3:$D$20,\"<\"&$D$3:$D$20)/(10^CEILING(LOG10(ROWS(Table1[Col B])),1))^2,0),COLUMN(A17))","v":"A"},{"$f":"INDEX($B$3:$D$20,MATCH(SMALL(COUNTIF($B$3:$B$20,\"<\"&$B$3:$B$20)+COUNTIF($C$3:$C$20,\"<\"&$C$3:$C$20)/(10^CEILING(LOG10(ROWS(Table1[Col B])),1))+COUNTIF($D$3:$D$20,\"<\"&$D$3:$D$20)/(10^CEILING(LOG10(ROWS(Table1[Col B])),1))^2,ROW(C17)),COUNTIF($B$3:$B$20,\"<\"&$B$3:$B$20)+COUNTIF($C$3:$C$20,\"<\"&$C$3:$C$20)/(10^CEILING(LOG10(ROWS(Table1[Col B])),1))+COUNTIF($D$3:$D$20,\"<\"&$D$3:$D$20)/(10^CEILING(LOG10(ROWS(Table1[Col B])),1))^2,0),COLUMN(B17))","v":"QQ"},{"$f":"INDEX($B$3:$D$20,MATCH(SMALL(COUNTIF($B$3:$B$20,\"<\"&$B$3:$B$20)+COUNTIF($C$3:$C$20,\"<\"&$C$3:$C$20)/(10^CEILING(LOG10(ROWS(Table1[Col B])),1))+COUNTIF($D$3:$D$20,\"<\"&$D$3:$D$20)/(10^CEILING(LOG10(ROWS(Table1[Col B])),1))^2,ROW(D17)),COUNTIF($B$3:$B$20,\"<\"&$B$3:$B$20)+COUNTIF($C$3:$C$20,\"<\"&$C$3:$C$20)/(10^CEILING(LOG10(ROWS(Table1[Col B])),1))+COUNTIF($D$3:$D$20,\"<\"&$D$3:$D$20)/(10^CEILING(LOG10(ROWS(Table1[Col B])),1))^2,0),COLUMN(C17))","v":"BBB"}]
[null,"A","AA","RRR",null,{"$f":"INDEX($B$3:$D$20,MATCH(SMALL(COUNTIF($B$3:$B$20,\"<\"&$B$3:$B$20)+COUNTIF($C$3:$C$20,\"<\"&$C$3:$C$20)/(10^CEILING(LOG10(ROWS(Table1[Col B])),1))+COUNTIF($D$3:$D$20,\"<\"&$D$3:$D$20)/(10^CEILING(LOG10(ROWS(Table1[Col B])),1))^2,ROW(B18)),COUNTIF($B$3:$B$20,\"<\"&$B$3:$B$20)+COUNTIF($C$3:$C$20,\"<\"&$C$3:$C$20)/(10^CEILING(LOG10(ROWS(Table1[Col B])),1))+COUNTIF($D$3:$D$20,\"<\"&$D$3:$D$20)/(10^CEILING(LOG10(ROWS(Table1[Col B])),1))^2,0),COLUMN(A18))","v":"A"},{"$f":"INDEX($B$3:$D$20,MATCH(SMALL(COUNTIF($B$3:$B$20,\"<\"&$B$3:$B$20)+COUNTIF($C$3:$C$20,\"<\"&$C$3:$C$20)/(10^CEILING(LOG10(ROWS(Table1[Col B])),1))+COUNTIF($D$3:$D$20,\"<\"&$D$3:$D$20)/(10^CEILING(LOG10(ROWS(Table1[Col B])),1))^2,ROW(C18)),COUNTIF($B$3:$B$20,\"<\"&$B$3:$B$20)+COUNTIF($C$3:$C$20,\"<\"&$C$3:$C$20)/(10^CEILING(LOG10(ROWS(Table1[Col B])),1))+COUNTIF($D$3:$D$20,\"<\"&$D$3:$D$20)/(10^CEILING(LOG10(ROWS(Table1[Col B])),1))^2,0),COLUMN(B18))","v":"RR"},{"$f":"INDEX($B$3:$D$20,MATCH(SMALL(COUNTIF($B$3:$B$20,\"<\"&$B$3:$B$20)+COUNTIF($C$3:$C$20,\"<\"&$C$3:$C$20)/(10^CEILING(LOG10(ROWS(Table1[Col B])),1))+COUNTIF($D$3:$D$20,\"<\"&$D$3:$D$20)/(10^CEILING(LOG10(ROWS(Table1[Col B])),1))^2,ROW(D18)),COUNTIF($B$3:$B$20,\"<\"&$B$3:$B$20)+COUNTIF($C$3:$C$20,\"<\"&$C$3:$C$20)/(10^CEILING(LOG10(ROWS(Table1[Col B])),1))+COUNTIF($D$3:$D$20,\"<\"&$D$3:$D$20)/(10^CEILING(LOG10(ROWS(Table1[Col B])),1))^2,0),COLUMN(C18))","v":"AAA"}]

{"sheet":"Filter & Sort","index":1,"n_rows":8,"n_cols":4,"rows_kept":8,"cut":false,"hidden":false,"merged":[]}
[]
[null,"Col B","Col C","Col D"]
[null,"A","CC","BBB"]
[null,"A","AA","DDD"]
[null,"A","CC","AAA"]
[null,"B","EE","AAA"]
[null,"B","CC","BBB"]
[null,"C","CC","AAA"]

{"sheet":"VBA","index":2,"n_rows":8,"n_cols":4,"rows_kept":8,"cut":false,"hidden":false,"merged":[]}
[]
[null,"Col B","Col C","Col D"]
[null,"A","AA","DDD"]
[null,"A","CC","AAA"]
[null,"A","CC","BBB"]
[null,"B","CC","BBB"]
[null,"B","EE","AAA"]
[null,"C","CC","AAA"]