{"text_format":"1","workbook":"xlsx","n_sheets":4,"sheets":["Calendar","Month","Day","Table"],"not_rendered":{"charts":0,"images":0,"macros":1,"external_links":0,"defined_names":0,"comments":0,"pivot_tables":0},"unopened":[],"bounds":{"document_bytes":16777216,"sheet_cells":100000,"rows_first":2000,"rows_last":500,"rows_between":2000,"halvings":0,"cell_chars":16384,"cell_head_chars":4096},"cells_cut":0,"cells_raw":0,"read":"whole","date_system":"1900"}

{"sheet":"Calendar","index":0,"n_rows":40,"n_cols":30,"rows_kept":40,"cut":false,"hidden":false,"merged":[[1,10,1,14],[23,1,23,7],[23,9,23,15],[23,17,23,23],[32,1,32,7],[32,9,32,15],[32,17,32,23],[5,1,5,7],[5,9,5,15],[5,17,5,23],[14,1,14,7],[14,9,14,15],[14,17,14,23],[3,1,3,2],[3,3,3,4],[3,5,3,6],[3,7,3,8],[3,9,3,10],[3,11,3,12],[3,13,3,14],[3,15,3,16],[3,17,3,18],[3,19,3,20],[3,21,3,22],[8,27,8,30],[9,27,9,30],[10,27,10,30],[11,27,11,30],[12,27,12,30],[13,27,13,30],[14,27,14,30],[15,27,15,30],[16,27,16,30],[17,27,17,30],[18,27,18,30],[19,27,19,30],[29,27,29,30],[20,27,20,30],[21,27,21,30],[22,27,22,30],[23,27,23,30],[24,27,24,30],[40,27,40,30],[7,26,7,30],[35,27,35,30],[36,27,36,30],[37,27,37,30],[38,27,38,30],[39,27,39,30],[30,27,30,30],[31,27,31,30],[32,27,32,30],[33,27,33,30],[34,27,34,30],[25,27,25,30],[26,27,26,30],[27,27,27,30],[28,27,28,30]]}
[]
[null,null,null,null,null,null,null,null,null,null,2013]
[]
[null,{"$f":"YEAR(TODAY())-2","v":2011},null,{"$f":"YEAR(TODAY())-1","v":2012},null,{"$f":"YEAR(TODAY())","v":2013},null,{"$f":"YEAR(TODAY())+1","v":2014},null,{"$f":"YEAR(TODAY())+2","v":2015},null,{"$f":"YEAR(TODAY())+3","v":2016},null,{"$f":"YEAR(TODAY())+4","v":2017},null,{"$f":"YEAR(TODAY())+5","v":2018},null,{"$f":"YEAR(TODAY())+6","v":2019},null,{"$f":"YEAR(TODAY())+7","v":2020},null,{"$f":"YEAR(TODAY())+8","v":2021},null,null,null,null,"Year","Month","Day","Table"]
[]
[null,"Jan",null,null,null,null,null,null,null,"Feb",null,null,null,null,null,null,null,"Mar",null,null,null,null,null,null,null,null,"Color:",null,null,41312]
[null,"Su","Mo","Tu","We","Th","Fr","Sa",null,"Su","Mo","Tu","We","Th","Fr","Sa",null,"Su","Mo","Tu","We","Th","Fr","Sa"]
[null,{"$f":"DATE($K$2,1,1)-WEEKDAY(DATE($K$2,1,1),1)+1","v":"2012-12-30"},{"$f":"B8+1","v":"2012-12-31"},"2013-01-01","2013-01-02","2013-01-03","2013-01-04","2013-01-05",null,{"$f":"DATE($K$2,2,1)-WEEKDAY(DATE($K$2,2,1),1)+1","v":"2013-01-27"},{"$f":"J8+1","v":"2013-01-28"},{"$f":"K8+1","v":"2013-01-29"},"2013-01-30","2013-01-31","2013-02-01","2013-02-02",null,{"$f":"DATE($K$2,3,1)-WEEKDAY(DATE($K$2,3,1),1)+1","v":"2013-02-24"},{"$f":"R8+1","v":"2013-02-25"},{"$f":"S8+1","v":"2013-02-26"},"2013-02-27","2013-02-28","2013-03-01","2013-03-02"]
[null,{"$f":"B8+7","v":"2013-01-06"},"2013-01-07","2013-01-08","2013-01-09","2013-01-10","2013-01-11","2013-01-12",null,{"$f":"J8+7","v":"2013-02-03"},{"$f":"J9+1","v":"2013-02-04"},"2013-02-05","2013-02-06","2013-02-07","2013-02-08","2013-02-09",null,{"$f":"R8+7","v":"2013-03-03"},{"$f":"R9+1","v":"2013-03-04"},"2013-03-05","2013-03-06","2013-03-07","2013-03-08","2013-03-09",null,null,"Time","Event"]
[null,{"$f":"B9+7","v":"2013-01-13"},"2013-01-14","2013-01-15","2013-01-16","2013-01-17","2013-01-18","2013-01-19",null,{"$f":"J9+7","v":"2013-02-10"},{"$f":"J10+1","v":"2013-02-11"},"2013-02-12","2013-02-13","2013-02-14","2013-02-15","2013-02-16",null,{"$f":"R9+7","v":"2013-03-10"},{"$f":"R10+1","v":"2013-03-11"},"2013-03-12","2013-03-13","2013-03-14","2013-03-15","2013-03-16",null,null,{"$f":"IFERROR(INDEX(Table1[Start],SMALL(IF($AA$8=INT(Table1[Start]),MATCH(ROW(Table1[Start]),ROW(Table1[Start])),\"\"),ROW(A1))),\"\")","v":""},{"$f":"IFERROR(INDEX(Table1[Events],SMALL(IF($AA$8=INT(Table1[Start]),MATCH(ROW(Table1[Start]),ROW(Table1[Start])),\"\"),ROW(C1))),\"\")","v":""}]
{"$rows_left_out":31}
{"sheet":"Month","index":1,"n_rows":37,"n_cols":20,"rows_kept":37,"cut":false,"hidden":false,"merged":[[1,2,1,13],[12,17,12,20],[6,17,6,20],[5,16,5,20],[6,1,6,2],[6,3,6,4],[6,5,6,6],[6,7,6,8],[6,9,6,10],[6,11,6,12],[6,13,6,14],[7,17,7,20],[8,17,8,20],[9,17,9,20],[10,17,10,20],[11,17,11,20],[24,17,24,20],[13,17,13,20],[14,17,14,20],[15,17,15,20],[16,17,16,20],[17,17,17,20],[18,17,18,20],[19,17,19,20],[20,17,20,20],[21,17,21,20],[22,17,22,20],[23,17,23,20],[36,17,36,20],[25,17,25,20],[26,17,26,20],[27,17,27,20],[28,17,28,20],[29,17,29,20],[30,17,30,20],[31,17,31,20],[32,17,32,20],[33,17,33,20],[34,17,34,20],[35,17,35,20]]}
[]
[null,null,{"$f":"O4&\" \"&O5","v":"Feb 2013"}]
[]
[null,null,"Jan","Feb","Mar","Apr","May","Jun","Jul","Aug","Sep","Oct","Nov","Dec","Feb",{"$f":"MATCH(O4,{\"Jan\",\"Feb\",\"Mar\",\"Apr\",\"May\",\"Jun\",\"Jul\",\"Aug\",\"Sep\",\"Oct\",\"Nov\",\"Dec\"},0)","v":2},"Year","Month","Day","Table"]
[null,null,{"$f":"YEAR(TODAY())-2","v":2011},{"$f":"YEAR(TODAY())-1","v":2012},{"$f":"YEAR(TODAY())","v":2013},{"$f":"YEAR(TODAY())+1","v":2014},{"$f":"YEAR(TODAY())+2","v":2015},{"$f":"YEAR(TODAY())+3","v":2016},{"$f":"YEAR(TODAY())+4","v":2017},{"$f":"YEAR(TODAY())+5","v":2018},{"$f":"YEAR(TODAY())+6","v":2019},{"$f":"YEAR(TODAY())+7","v":2020},{"$f":"YEAR(TODAY())+8","v":2021},{"$f":"YEAR(TODAY())+9","v":2022},2013]
[]
[null,"Sunday",null,"Monday",null,"Tuesday",null,"Wednesday",null,"Thursday",null,"Friday",null,"Saturday",null,null,"Time","Event"]
[null,{"$f":"DATE(O5,MATCH(O4,{\"Jan\",\"Feb\",\"Mar\",\"Apr\",\"May\",\"Jun\",\"Jul\",\"Aug\",\"Sep\",\"Oct\",\"Nov\",\"Dec\"},0),1)-WEEKDAY(DATE(O5,MATCH(O4,{\"Jan\",\"Feb\",\"Mar\",\"Apr\",\"May\",\"Jun\",\"Jul\",\"Aug\",\"Sep\",\"Oct\",\"Nov\",\"Dec\"},0),1))+1","v":"2013-01-27"},null,{"$f":"B8+1","v":"2013-01-28"},null,{"$f":"D8+1","v":"2013-01-29"},null,{"$f":"F8+1","v":"2013-01-30"},null,{"$f":"H8+1","v":"2013-01-31"},null,{"$f":"J8+1","v":"2013-02-01"},null,{"$f":"L8+1","v":"2013-02-02"},null,null,{"$f":"IFERROR(INDEX(Table1[Start],SMALL(IF(INT(Table1[Start])=Month!$Q$6,MATCH(ROW(Table1[Start]),ROW(Table1[Start])),\"\"),ROW(A1))),\"\")","v":""},{"$f":"IFERROR(INDEX(Table1[Events],SMALL(IF(INT(Table1[Start])=Month!$Q$6,MATCH(ROW(Table1[Start]),ROW(Table1[Start])),\"\"),ROW(A1))),\"\")","v":""}]
[null,{"$f":"IFERROR(INDEX(Table1[Start],SMALL(IF(Month!B$8=INT(Table1[Start]),MATCH(ROW(Table1[Start]),ROW(Table1[Start])),\"\"),ROW(A1))),\"\")","v":""},{"$f":"IFERROR(LEFT(INDEX(Table1[Events],SMALL(IF(Month!B$8=INT(Table1[Start]),MATCH(ROW(Table1[Start]),ROW(Table1[Start])),\"\"),ROW(A1))),15),\"\")","v":""},{"$f":"IFERROR(INDEX(Table1[Start],SMALL(IF(Month!D$8=INT(Table1[Start]),MATCH(ROW(Table1[Start]),ROW(Table1[Start])),\"\"),ROW(C1))),\"\")","v":""},{"$f":"IFERROR(LEFT(INDEX(Table1[Events],SMALL(IF(Month!D$8=INT(Table1[Start]),MATCH(ROW(Table1[Start]),ROW(Table1[Start])),\"\"),ROW(C1))),15),\"\")","v":""},{"$f":"IFERROR(INDEX(Table1[Start],SMALL(IF(Month!F$8=INT(Table1[Start]),MATCH(ROW(Table1[Start]),ROW(Table1[Start])),\"\"),ROW(E1))),\"\")","v":""},{"$f":"IFERROR(LEFT(INDEX(Table1[Events],SMALL(IF(Month!F$8=INT(Table1[Start]),MATCH(ROW(Table1[Start]),ROW(Table1[Start])),\"\"),ROW(E1))),15),\"\")","v":""},{"$f":"IFERROR(INDEX(Table1[Start],SMALL(IF(Month!H$8=INT(Table1[Start]),MATCH(ROW(Table1[Start]),ROW(Table1[Start])),\"\"),ROW(G1))),\"\")","v":""},{"$f":"IFERROR(LEFT(INDEX(Table1[Events],SMALL(IF(Month!H$8=INT(Table1[Start]),MATCH(ROW(Table1[Start]),ROW(Table1[Start])),\"\"),ROW(G1))),15),\"\")","v":""},{"$f":"IFERROR(INDEX(Table1[Start],SMALL(IF(Month!J$8=INT(Table1[Start]),MATCH(ROW(Table1[Start]),ROW(Table1[Start])),\"\"),ROW(I1))),\"\")","v":""},{"$f":"IFERROR(LEFT(INDEX(Table1[Events],SMALL(IF(Month!J$8=INT(Table1[Start]),MATCH(ROW(Table1[Start]),ROW(Table1[Start])),\"\"),ROW(I1))),15),\"\")","v":""},{"$f":"IFERROR(INDEX(Table1[Start],SMALL(IF(Month!L$8=INT(Table1[Start]),MATCH(ROW(Table1[Start]),ROW(Table1[Start])),\"\"),ROW(K1))),\"\")","v":""},{"$f":"IFERROR(LEFT(INDEX(Table1[Events],SMALL(IF(Month!L$8=INT(Table1[Start]),MATCH(ROW(Table1[Start]),ROW(Table1[Start])),\"\"),ROW(K1))),15),\"\")","v":""},{"$f":"IFERROR(INDEX(Table1[Start],SMALL(IF(Month!N$8=INT(Table1[Start]),MATCH(ROW(Table1[Start]),ROW(Table1[Start])),\"\"),ROW(M1))),\"\")","v":""},{"$f":"IFERROR(LEFT(INDEX(Table1[Events],SMALL(IF(Month!N$8=INT(Table1[Start]),MATCH(ROW(Table1[Start]),ROW(Table1[Start])),\"\"),ROW(M1))),15),\"\")","v":""},null,{"$f":"IFERROR(INDEX(Table1[Start],SMALL(IF(INT(Table1[Start])=Month!$Q$6,MATCH(ROW(Table1[Start]),ROW(Table1[Start])),\"\"),ROW(A2))),\"\")","v":""},{"$f":"IFERROR(INDEX(Table1[Events],SMALL(IF(INT(Table1[Start])=Month!$Q$6,MATCH(ROW(Table1[Start]),ROW(Table1[Start])),\"\"),ROW(A2))),\"\")","v":""}]
[null,{"$f":"IFERROR(INDEX(Table1[Start],SMALL(IF(Month!B$8=INT(Table1[Start]),MATCH(ROW(Table1[Start]),ROW(Table1[Start])),\"\"),ROW(A2))),\"\")","v":""},{"$f":"IFERROR(LEFT(INDEX(Table1[Events],SMALL(IF(Month!B$8=INT(Table1[Start]),MATCH(ROW(Table1[Start]),ROW(Table1[Start])),\"\"),ROW(A2))),15),\"\")","v":""},{"$f":"IFERROR(INDEX(Table1[Start],SMALL(IF(Month!D$8=INT(Table1[Start]),MATCH(ROW(Table1[Start]),ROW(Table1[Start])),\"\"),ROW(C2))),\"\")","v":""},{"$f":"IFERROR(LEFT(INDEX(Table1[Events],SMALL(IF(Month!D$8=INT(Table1[Start]),MATCH(ROW(Table1[Start]),ROW(Table1[Start])),\"\"),ROW(C2))),15),\"\")","v":""},{"$f":"IFERROR(INDEX(Table1[Start],SMALL(IF(Month!F$8=INT(Table1[Start]),MATCH(ROW(Table1[Start]),ROW(Table1[Start])),\"\"),ROW(E2))),\"\")","v":""},{"$f":"IFERROR(LEFT(INDEX(Table1[Events],SMALL(IF(Month!F$8=INT(Table1[Start]),MATCH(ROW(Table1[Start]),ROW(Table1[Start])),\"\"),ROW(E2))),15),\"\")","v":""},{"$f":"IFERROR(INDEX(Table1[Start],SMALL(IF(Month!H$8=INT(Table1[Start]),MATCH(ROW(Table1[Start]),ROW(Table1[Start])),\"\"),ROW(G2))),\"\")","v":""},{"$f":"IFERROR(LEFT(INDEX(Table1[Events],SMALL(IF(Month!H$8=INT(Table1[Start]),MATCH(ROW(Table1[Start]),ROW(Table1[Start])),\"\"),ROW(G2))),15),\"\")","v":""},{"$f":"IFERROR(INDEX(Table1[Start],SMALL(IF(Month!J$8=INT(Table1[Start]),MATCH(ROW(Table1[Start]),ROW(Table1[Start])),\"\"),ROW(I2))),\"\")","v":""},{"$f":"IFERROR(LEFT(INDEX(Table1[Events],SMALL(IF(Month!J$8=INT(Table1[Start]),MATCH(ROW(Table1[Start]),ROW(Table1[Start])),\"\"),ROW(I2))),15),\"\")","v":""},{"$f":"IFERROR(INDEX(Table1[Start],SMALL(IF(Month!L$8=INT(Table1[Start]),MATCH(ROW(Table1[Start]),ROW(Table1[Start])),\"\"),ROW(K2))),\"\")","v":""},{"$f":"IFERROR(LEFT(INDEX(Table1[Events],SMALL(IF(Month!L$8=INT(Table1[Start]),MATCH(ROW(Table1[Start]),ROW(Table1[Start])),\"\"),ROW(K2))),15),\"\")","v":""},{"$f":"IFERROR(INDEX(Table1[Start],SMALL(IF(Month!N$8=INT(Table1[Start]),MATCH(ROW(Table1[Start]),ROW(Table1[Start])),\"\"),ROW(M2))),\"\")","v":""},{"$f":"IFERROR(LEFT(INDEX(Table1[Events],SMALL(IF(Month!N$8=INT(Table1[Start]),MATCH(ROW(Table1[Start]),ROW(Table1[Start])),\"\"),ROW(M2))),15),\"\")","v":""},null,{"$f":"IFERROR(INDEX(Table1[Start],SMALL(IF(INT(Table1[Start])=Month!$Q$6,MATCH(ROW(Table1[Start]),ROW(Table1[Start])),\"\"),ROW(A3))),\"\")","v":""},{"$f":"IFERROR(INDEX(Table1[Events],SMALL(IF(INT(Table1[Start])=Month!$Q$6,MATCH(ROW(Table1[Start]),ROW(Table1[Start])),\"\"),ROW(A3))),\"\")","v":""}]
{"$rows_left_out":28}
{"sheet":"Day","index":2,"n_rows":26,"n_cols":16,"rows_kept":26,"cut":false,"hidden":false,"merged":[[1,4,1,10],[11,4,24,15],[10,4,10,15]]}
[]
[null,"Time","2013-02-07",null,{"$f":"C2","v":"2013-02-07"},null,null,null,null,null,null,null,"Year","Month","Day","Table"]
[null,{"$f":"C2","v":41312},{"$f":"IFERROR(INDEX(Table1[Events],MATCH(ROUND(B3,4),ROUND(Table1[Start],4),0)),\"\")","v":""},null,"Su","Mo","Tu","We","Th","Fr","Sa"]
[null,{"$f":"1/24+ B3","v":41312.041666666664},{"$f":"IFERROR(INDEX(Table1[Events],MATCH(ROUND(B4,4),ROUND(Table1[Start],4),0)),\"\")","v":""},null,{"$f":"DATE(Calendar!$K$2,MATCH(Month!$O$4,{\"Jan\",\"Feb\",\"Mar\",\"Apr\",\"May\",\"Jun\",\"Jul\",\"Aug\",\"Sep\",\"Oct\",\"Nov\",\"Dec\"},0),1)-WEEKDAY(DATE(Calendar!$K$2,MATCH(Month!$O$4,{\"Jan\",\"Feb\",\"Mar\",\"Apr\",\"May\",\"Jun\",\"Jul\",\"Aug\",\"Sep\",\"Oct\",\"Nov\",\"Dec\"},0),1),1)+1","v":"2013-01-27"},{"$f":"E4+1","v":"2013-01-28"},"2013-01-29","2013-01-30","2013-01-31","2013-02-01","2013-02-02"]
[null,{"$f":"1/24+ B4","v":41312.083333333328},{"$f":"IFERROR(INDEX(Table1[Events],MATCH(ROUND(B5,4),ROUND(Table1[Start],4),0)),\"\")","v":""},null,{"$f":"E4+7","v":"2013-02-03"},"2013-02-04","2013-02-05","2013-02-06","2013-02-07","2013-02-08","2013-02-09"]
[null,41312.124999999993,{"$f":"IFERROR(INDEX(Table1[Events],MATCH(ROUND(B6,4),ROUND(Table1[Start],4),0)),\"\")","v":""},null,{"$f":"E5+7","v":"2013-02-10"},"2013-02-11","2013-02-12","2013-02-13","2013-02-14","2013-02-15","2013-02-16"]
[null,41312.166666666657,{"$f":"IFERROR(INDEX(Table1[Events],MATCH(ROUND(B7,4),ROUND(Table1[Start],4),0)),\"\")","v":""},null,{"$f":"E6+7","v":"2013-02-17"},"2013-02-18","2013-02-19","2013-02-20","2013-02-21","2013-02-22","2013-02-23"]
[null,41312.208333333321,{"$f":"IFERROR(INDEX(Table1[Events],MATCH(ROUND(B8,4),ROUND(Table1[Start],4),0)),\"\")","v":""},null,{"$f":"E7+7","v":"2013-02-24"},"2013-02-25","2013-02-26","2013-02-27","2013-02-28","2013-03-01","2013-03-02"]
[null,41312.249999999985,{"$f":"IFERROR(INDEX(Table1[Events],MATCH(ROUND(B9,4),ROUND(Table1[Start],4),0)),\"\")","v":""},null,{"$f":"E8+7","v":"2013-03-03"},"2013-03-04","2013-03-05","2013-03-06","2013-03-07","2013-03-08","2013-03-09"]
[null,41312.29166666665,{"$f":"IFERROR(INDEX(Table1[Events],MATCH(ROUND(B10,4),ROUND(Table1[Start],4),0)),\"\")","v":""}]
{"$rows_left_out":17}
{"sheet":"Table","index":3,"n_rows":23,"n_cols":4,"rows_kept":23,"cut":false,"hidden":false,"merged":[]}
[]
[null,"Start","End","Events"]
[null,"2013-01-08T09:00:00","2013-01-08T12:00:00","Event 1"]
[null,"2013-01-09T08:00:00","2013-01-09T21:00:00","Event 9"]
[null,"2013-01-09T08:00:00","2013-01-09T09:00:00","Event 10"]
[null,"2013-02-07T08:00:00","2013-02-07T08:00:00","Event 3"]
[null,"2013-02-07T09:00:00","2013-02-07T10:00:00","Event 11"]
[null,"2013-02-08T08:00:00","2013-02-08T09:00:00","Event 12"]
[null,"2013-02-08T10:00:00","2013-02-08T12:00:00","Event 13"]
[null,"2013-02-25T08:00:00","2013-02-25T16:00:00","Event 2"]
{"$rows_left_out":13}