{"text_format":"1","workbook":"xlsx","n_sheets":4,"sheets":["Calendar","Month","Day","Table"],"not_rendered":{"charts":0,"images":0,"macros":1,"external_links":0,"defined_names":0,"comments":0,"pivot_tables":0},"unopened":[],"bounds":{"document_bytes":16777216,"sheet_cells":100000,"rows_first":2000,"rows_last":500,"rows_between":2000,"halvings":0,"cell_chars":16384,"cell_head_chars":4096},"cells_cut":0,"cells_raw":0,"read":"whole","date_system":"1900"}

{"sheet":"Calendar","index":0,"n_rows":40,"n_cols":30,"rows_kept":40,"cut":false,"hidden":false,"merged":[[1,10,1,14],[23,1,23,7],[23,9,23,15],[23,17,23,23],[32,1,32,7],[32,9,32,15],[32,17,32,23],[5,1,5,7],[5,9,5,15],[5,17,5,23],[14,1,14,7],[14,9,14,15],[14,17,14,23],[3,1,3,2],[3,3,3,4],[3,5,3,6],[3,7,3,8],[3,9,3,10],[3,11,3,12],[3,13,3,14],[3,15,3,16],[3,17,3,18],[3,19,3,20],[3,21,3,22],[8,27,8,30],[9,27,9,30],[10,27,10,30],[11,27,11,30],[12,27,12,30],[13,27,13,30],[14,27,14,30],[15,27,15,30],[16,27,16,30],[17,27,17,30],[18,27,18,30],[19,27,19,30],[29,27,29,30],[20,27,20,30],[21,27,21,30],[22,27,22,30],[23,27,23,30],[24,27,24,30],[40,27,40,30],[7,26,7,30],[35,27,35,30],[36,27,36,30],[37,27,37,30],[38,27,38,30],[39,27,39,30],[30,27,30,30],[31,27,31,30],[32,27,32,30],[33,27,33,30],[34,27,34,30],[25,27,25,30],[26,27,26,30],[27,27,27,30],[28,27,28,30]]}
[]
[null,null,null,null,null,null,null,null,null,null,2013]
[]
[null,{"$f":"YEAR(TODAY())-2","v":2011},null,{"$f":"YEAR(TODAY())-1","v":2012},null,{"$f":"YEAR(TODAY())","v":2013},null,{"$f":"YEAR(TODAY())+1","v":2014},null,{"$f":"YEAR(TODAY())+2","v":2015},null,{"$f":"YEAR(TODAY())+3","v":2016},null,{"$f":"YEAR(TODAY())+4","v":2017},null,{"$f":"YEAR(TODAY())+5","v":2018},null,{"$f":"YEAR(TODAY())+6","v":2019},null,{"$f":"YEAR(TODAY())+7","v":2020},null,{"$f":"YEAR(TODAY())+8","v":2021},null,null,null,null,"Year","Month","Day","Table"]
[]
[null,"Jan",null,null,null,null,null,null,null,"Feb",null,null,null,null,null,null,null,"Mar",null,null,null,null,null,null,null,null,"Color:",null,null,41312]
[null,"Su","Mo","Tu","We","Th","Fr","Sa",null,"Su","Mo","Tu","We","Th","Fr","Sa",null,"Su","Mo","Tu","We","Th","Fr","Sa"]
[null,{"$f":"DATE($K$2,1,1)-WEEKDAY(DATE($K$2,1,1),1)+1","v":"2012-12-30"},{"$f":"B8+1","v":"2012-12-31"},"2013-01-01","2013-01-02","2013-01-03","2013-01-04","2013-01-05",null,{"$f":"DATE($K$2,2,1)-WEEKDAY(DATE($K$2,2,1),1)+1","v":"2013-01-27"},{"$f":"J8+1","v":"2013-01-28"},{"$f":"K8+1","v":"2013-01-29"},"2013-01-30","2013-01-31","2013-02-01","2013-02-02",null,{"$f":"DATE($K$2,3,1)-WEEKDAY(DATE($K$2,3,1),1)+1","v":"2013-02-24"},{"$f":"R8+1","v":"2013-02-25"},{"$f":"S8+1","v":"2013-02-26"},"2013-02-27","2013-02-28","2013-03-01","2013-03-02"]
[null,{"$f":"B8+7","v":"2013-01-06"},"2013-01-07","2013-01-08","2013-01-09","2013-01-10","2013-01-11","2013-01-12",null,{"$f":"J8+7","v":"2013-02-03"},{"$f":"J9+1","v":"2013-02-04"},"2013-02-05","2013-02-06","2013-02-07","2013-02-08","2013-02-09",null,{"$f":"R8+7","v":"2013-03-03"},{"$f":"R9+1","v":"2013-03-04"},"2013-03-05","2013-03-06","2013-03-07","2013-03-08","2013-03-09",null,null,"Time","Event"]
[null,{"$f":"B9+7","v":"2013-01-13"},"2013-01-14","2013-01-15","2013-01-16","2013-01-17","2013-01-18","2013-01-19",null,{"$f":"J9+7","v":"2013-02-10"},{"$f":"J10+1","v":"2013-02-11"},"2013-02-12","2013-02-13","2013-02-14","2013-02-15","2013-02-16",null,{"$f":"R9+7","v":"2013-03-10"},{"$f":"R10+1","v":"2013-03-11"},"2013-03-12","2013-03-13","2013-03-14","2013-03-15","2013-03-16",null,null,{"$f":"IFERROR(INDEX(Table1[Start],SMALL(IF($AA$8=INT(Table1[Start]),MATCH(ROW(Table1[Start]),ROW(Table1[Start])),\"\"),ROW(A1))),\"\")","v":""},{"$f":"IFERROR(INDEX(Table1[Events],SMALL(IF($AA$8=INT(Table1[Start]),MATCH(ROW(Table1[Start]),ROW(Table1[Start])),\"\"),ROW(C1))),\"\")","v":""}]
[null,{"$f":"B10+7","v":"2013-01-20"},"2013-01-21","2013-01-22","2013-01-23","2013-01-24","2013-01-25","2013-01-26",null,"2013-02-17",{"$f":"J11+1","v":"2013-02-18"},"2013-02-19","2013-02-20","2013-02-21","2013-02-22","2013-02-23",null,"2013-03-17",{"$f":"R11+1","v":"2013-03-18"},"2013-03-19","2013-03-20","2013-03-21","2013-03-22","2013-03-23",null,null,{"$f":"IFERROR(INDEX(Table1[Start],SMALL(IF($AA$8=INT(Table1[Start]),MATCH(ROW(Table1[Start]),ROW(Table1[Start])),\"\"),ROW(A2))),\"\")","v":""},{"$f":"IFERROR(INDEX(Table1[Events],SMALL(IF($AA$8=INT(Table1[Start]),MATCH(ROW(Table1[Start]),ROW(Table1[Start])),\"\"),ROW(C2))),\"\")","v":""}]
[null,{"$f":"B11+7","v":"2013-01-27"},{"$f":"B12+1","v":"2013-01-28"},"2013-01-29","2013-01-30","2013-01-31","2013-02-01","2013-02-02",null,"2013-02-24",{"$f":"J12+1","v":"2013-02-25"},"2013-02-26","2013-02-27","2013-02-28","2013-03-01","2013-03-02",null,"2013-03-24",{"$f":"R12+1","v":"2013-03-25"},"2013-03-26","2013-03-27","2013-03-28","2013-03-29","2013-03-30",null,null,{"$f":"IFERROR(INDEX(Table1[Start],SMALL(IF($AA$8=INT(Table1[Start]),MATCH(ROW(Table1[Start]),ROW(Table1[Start])),\"\"),ROW(A3))),\"\")","v":""},{"$f":"IFERROR(INDEX(Table1[Events],SMALL(IF($AA$8=INT(Table1[Start]),MATCH(ROW(Table1[Start]),ROW(Table1[Start])),\"\"),ROW(C3))),\"\")","v":""}]
[null,{"$f":"B12+7","v":"2013-02-03"},{"$f":"B13+1","v":"2013-02-04"},"2013-02-05","2013-02-06","2013-02-07","2013-02-08","2013-02-09",null,"2013-03-03",{"$f":"J13+1","v":"2013-03-04"},"2013-03-05","2013-03-06","2013-03-07","2013-03-08","2013-03-09",null,"2013-03-31",{"$f":"R13+1","v":"2013-04-01"},"2013-04-02","2013-04-03","2013-04-04","2013-04-05","2013-04-06",null,null,{"$f":"IFERROR(INDEX(Table1[Start],SMALL(IF($AA$8=INT(Table1[Start]),MATCH(ROW(Table1[Start]),ROW(Table1[Start])),\"\"),ROW(A4))),\"\")","v":""},{"$f":"IFERROR(INDEX(Table1[Events],SMALL(IF($AA$8=INT(Table1[Start]),MATCH(ROW(Table1[Start]),ROW(Table1[Start])),\"\"),ROW(C4))),\"\")","v":""}]
[null,null,null,null,null,null,null,null,null,null,null,null,null,null,null,null,null,null,null,null,null,null,null,null,null,null,{"$f":"IFERROR(INDEX(Table1[Start],SMALL(IF($AA$8=INT(Table1[Start]),MATCH(ROW(Table1[Start]),ROW(Table1[Start])),\"\"),ROW(A5))),\"\")","v":""},{"$f":"IFERROR(INDEX(Table1[Events],SMALL(IF($AA$8=INT(Table1[Start]),MATCH(ROW(Table1[Start]),ROW(Table1[Start])),\"\"),ROW(C5))),\"\")","v":""}]
[null,"Apr",null,null,null,null,null,null,null,"May",null,null,null,null,null,null,null,"Jun",null,null,null,null,null,null,null,null,{"$f":"IFERROR(INDEX(Table1[Start],SMALL(IF($AA$8=INT(Table1[Start]),MATCH(ROW(Table1[Start]),ROW(Table1[Start])),\"\"),ROW(A6))),\"\")","v":""},{"$f":"IFERROR(INDEX(Table1[Events],SMALL(IF($AA$8=INT(Table1[Start]),MATCH(ROW(Table1[Start]),ROW(Table1[Start])),\"\"),ROW(C6))),\"\")","v":""}]
[null,"Su","Mo","Tu","We","Th","Fr","Sa",null,"Su","Mo","Tu","We","Th","Fr","Sa",null,"Su","Mo","Tu","We","Th","Fr","Sa",null,null,{"$f":"IFERROR(INDEX(Table1[Start],SMALL(IF($AA$8=INT(Table1[Start]),MATCH(ROW(Table1[Start]),ROW(Table1[Start])),\"\"),ROW(A7))),\"\")","v":""},{"$f":"IFERROR(INDEX(Table1[Events],SMALL(IF($AA$8=INT(Table1[Start]),MATCH(ROW(Table1[Start]),ROW(Table1[Start])),\"\"),ROW(C7))),\"\")","v":""}]
[null,{"$f":"DATE($K$2,4,1)-WEEKDAY(DATE($K$2,4,1),1)+1","v":"2013-03-31"},{"$f":"B17+1","v":"2013-04-01"},{"$f":"C17+1","v":"2013-04-02"},"2013-04-03","2013-04-04","2013-04-05","2013-04-06",null,{"$f":"DATE($K$2,5,1)-WEEKDAY(DATE($K$2,5,1),1)+1","v":"2013-04-28"},{"$f":"J17+1","v":"2013-04-29"},{"$f":"K17+1","v":"2013-04-30"},"2013-05-01","2013-05-02","2013-05-03","2013-05-04",null,{"$f":"DATE($K$2,6,1)-WEEKDAY(DATE($K$2,6,1),1)+1","v":"2013-05-26"},{"$f":"R17+1","v":"2013-05-27"},{"$f":"S17+1","v":"2013-05-28"},"2013-05-29","2013-05-30","2013-05-31","2013-06-01",null,null,{"$f":"IFERROR(INDEX(Table1[Start],SMALL(IF($AA$8=INT(Table1[Start]),MATCH(ROW(Table1[Start]),ROW(Table1[Start])),\"\"),ROW(A8))),\"\")","v":""},{"$f":"IFERROR(INDEX(Table1[Events],SMALL(IF($AA$8=INT(Table1[Start]),MATCH(ROW(Table1[Start]),ROW(Table1[Start])),\"\"),ROW(C8))),\"\")","v":""}]
[null,{"$f":"B17+7","v":"2013-04-07"},{"$f":"B18+1","v":"2013-04-08"},"2013-04-09","2013-04-10","2013-04-11","2013-04-12","2013-04-13",null,{"$f":"J17+7","v":"2013-05-05"},{"$f":"J18+1","v":"2013-05-06"},"2013-05-07","2013-05-08","2013-05-09","2013-05-10","2013-05-11",null,{"$f":"R17+7","v":"2013-06-02"},{"$f":"R18+1","v":"2013-06-03"},"2013-06-04","2013-06-05","2013-06-06","2013-06-07","2013-06-08",null,null,{"$f":"IFERROR(INDEX(Table1[Start],SMALL(IF($AA$8=INT(Table1[Start]),MATCH(ROW(Table1[Start]),ROW(Table1[Start])),\"\"),ROW(A9))),\"\")","v":""},{"$f":"IFERROR(INDEX(Table1[Events],SMALL(IF($AA$8=INT(Table1[Start]),MATCH(ROW(Table1[Start]),ROW(Table1[Start])),\"\"),ROW(C9))),\"\")","v":""}]
[null,{"$f":"B18+7","v":"2013-04-14"},{"$f":"B19+1","v":"2013-04-15"},"2013-04-16","2013-04-17","2013-04-18","2013-04-19","2013-04-20",null,{"$f":"J18+7","v":"2013-05-12"},{"$f":"J19+1","v":"2013-05-13"},"2013-05-14","2013-05-15","2013-05-16","2013-05-17","2013-05-18",null,{"$f":"R18+7","v":"2013-06-09"},{"$f":"R19+1","v":"2013-06-10"},"2013-06-11","2013-06-12","2013-06-13","2013-06-14","2013-06-15",null,null,{"$f":"IFERROR(INDEX(Table1[Start],SMALL(IF($AA$8=INT(Table1[Start]),MATCH(ROW(Table1[Start]),ROW(Table1[Start])),\"\"),ROW(A10))),\"\")","v":""},{"$f":"IFERROR(INDEX(Table1[Events],SMALL(IF($AA$8=INT(Table1[Start]),MATCH(ROW(Table1[Start]),ROW(Table1[Start])),\"\"),ROW(C10))),\"\")","v":""}]
[null,"2013-04-21",{"$f":"B20+1","v":"2013-04-22"},"2013-04-23","2013-04-24","2013-04-25","2013-04-26","2013-04-27",null,"2013-05-19",{"$f":"J20+1","v":"2013-05-20"},"2013-05-21","2013-05-22","2013-05-23","2013-05-24","2013-05-25",null,"2013-06-16",{"$f":"R20+1","v":"2013-06-17"},"2013-06-18","2013-06-19","2013-06-20","2013-06-21","2013-06-22",null,null,{"$f":"IFERROR(INDEX(Table1[Start],SMALL(IF($AA$8=INT(Table1[Start]),MATCH(ROW(Table1[Start]),ROW(Table1[Start])),\"\"),ROW(A11))),\"\")","v":""},{"$f":"IFERROR(INDEX(Table1[Events],SMALL(IF($AA$8=INT(Table1[Start]),MATCH(ROW(Table1[Start]),ROW(Table1[Start])),\"\"),ROW(C11))),\"\")","v":""}]
[null,"2013-04-28",{"$f":"B21+1","v":"2013-04-29"},"2013-04-30","2013-05-01","2013-05-02","2013-05-03","2013-05-04",null,"2013-05-26",{"$f":"J21+1","v":"2013-05-27"},"2013-05-28","2013-05-29","2013-05-30","2013-05-31","2013-06-01",null,"2013-06-23",{"$f":"R21+1","v":"2013-06-24"},"2013-06-25","2013-06-26","2013-06-27","2013-06-28","2013-06-29",null,null,{"$f":"IFERROR(INDEX(Table1[Start],SMALL(IF($AA$8=INT(Table1[Start]),MATCH(ROW(Table1[Start]),ROW(Table1[Start])),\"\"),ROW(A12))),\"\")","v":""},{"$f":"IFERROR(INDEX(Table1[Events],SMALL(IF($AA$8=INT(Table1[Start]),MATCH(ROW(Table1[Start]),ROW(Table1[Start])),\"\"),ROW(C12))),\"\")","v":""}]
[null,"2013-05-05",{"$f":"B22+1","v":"2013-05-06"},"2013-05-07","2013-05-08","2013-05-09","2013-05-10","2013-05-11",null,"2013-06-02",{"$f":"J22+1","v":"2013-06-03"},"2013-06-04","2013-06-05","2013-06-06","2013-06-07","2013-06-08",null,"2013-06-30",{"$f":"R22+1","v":"2013-07-01"},"2013-07-02","2013-07-03","2013-07-04","2013-07-05","2013-07-06",null,null,{"$f":"IFERROR(INDEX(Table1[Start],SMALL(IF($AA$8=INT(Table1[Start]),MATCH(ROW(Table1[Start]),ROW(Table1[Start])),\"\"),ROW(A13))),\"\")","v":""},{"$f":"IFERROR(INDEX(Table1[Events],SMALL(IF($AA$8=INT(Table1[Start]),MATCH(ROW(Table1[Start]),ROW(Table1[Start])),\"\"),ROW(C13))),\"\")","v":""}]
[null,null,null,null,null,null,null,null,null,null,null,null,null,null,null,null,null,null,null,null,null,null,null,null,null,null,{"$f":"IFERROR(INDEX(Table1[Start],SMALL(IF($AA$8=INT(Table1[Start]),MATCH(ROW(Table1[Start]),ROW(Table1[Start])),\"\"),ROW(A14))),\"\")","v":""},{"$f":"IFERROR(INDEX(Table1[Events],SMALL(IF($AA$8=INT(Table1[Start]),MATCH(ROW(Table1[Start]),ROW(Table1[Start])),\"\"),ROW(C14))),\"\")","v":""}]
[null,"Jul",null,null,null,null,null,null,null,"Aug",null,null,null,null,null,null,null,"Sep",null,null,null,null,null,null,null,null,{"$f":"IFERROR(INDEX(Table1[Start],SMALL(IF($AA$8=INT(Table1[Start]),MATCH(ROW(Table1[Start]),ROW(Table1[Start])),\"\"),ROW(A15))),\"\")","v":""},{"$f":"IFERROR(INDEX(Table1[Events],SMALL(IF($AA$8=INT(Table1[Start]),MATCH(ROW(Table1[Start]),ROW(Table1[Start])),\"\"),ROW(C15))),\"\")","v":""}]
[null,"Su","Mo","Tu","We","Th","Fr","Sa",null,"Su","Mo","Tu","We","Th","Fr","Sa",null,"Su","Mo","Tu","We","Th","Fr","Sa",null,null,{"$f":"IFERROR(INDEX(Table1[Start],SMALL(IF($AA$8=INT(Table1[Start]),MATCH(ROW(Table1[Start]),ROW(Table1[Start])),\"\"),ROW(A16))),\"\")","v":""},{"$f":"IFERROR(INDEX(Table1[Events],SMALL(IF($AA$8=INT(Table1[Start]),MATCH(ROW(Table1[Start]),ROW(Table1[Start])),\"\"),ROW(C16))),\"\")","v":""}]
[null,{"$f":"DATE($K$2,7,1)-WEEKDAY(DATE($K$2,7,1),1)+1","v":"2013-06-30"},{"$f":"B26+1","v":"2013-07-01"},{"$f":"C26+1","v":"2013-07-02"},"2013-07-03","2013-07-04","2013-07-05","2013-07-06",null,{"$f":"DATE($K$2,8,1)-WEEKDAY(DATE($K$2,8,1),1)+1","v":"2013-07-28"},{"$f":"J26+1","v":"2013-07-29"},{"$f":"K26+1","v":"2013-07-30"},"2013-07-31","2013-08-01","2013-08-02","2013-08-03",null,{"$f":"DATE($K$2,9,1)-WEEKDAY(DATE($K$2,9,1),1)+1","v":"2013-09-01"},{"$f":"R26+1","v":"2013-09-02"},{"$f":"S26+1","v":"2013-09-03"},"2013-09-04","2013-09-05","2013-09-06","2013-09-07",null,null,{"$f":"IFERROR(INDEX(Table1[Start],SMALL(IF($AA$8=INT(Table1[Start]),MATCH(ROW(Table1[Start]),ROW(Table1[Start])),\"\"),ROW(A17))),\"\")","v":""},{"$f":"IFERROR(INDEX(Table1[Events],SMALL(IF($AA$8=INT(Table1[Start]),MATCH(ROW(Table1[Start]),ROW(Table1[Start])),\"\"),ROW(C17))),\"\")","v":""}]
[null,{"$f":"B26+7","v":"2013-07-07"},{"$f":"B27+1","v":"2013-07-08"},"2013-07-09","2013-07-10","2013-07-11","2013-07-12","2013-07-13",null,{"$f":"J26+7","v":"2013-08-04"},{"$f":"J27+1","v":"2013-08-05"},"2013-08-06","2013-08-07","2013-08-08","2013-08-09","2013-08-10",null,{"$f":"R26+7","v":"2013-09-08"},{"$f":"R27+1","v":"2013-09-09"},"2013-09-10","2013-09-11","2013-09-12","2013-09-13","2013-09-14",null,null,{"$f":"IFERROR(INDEX(Table1[Start],SMALL(IF($AA$8=INT(Table1[Start]),MATCH(ROW(Table1[Start]),ROW(Table1[Start])),\"\"),ROW(A18))),\"\")","v":""},{"$f":"IFERROR(INDEX(Table1[Events],SMALL(IF($AA$8=INT(Table1[Start]),MATCH(ROW(Table1[Start]),ROW(Table1[Start])),\"\"),ROW(C18))),\"\")","v":""}]
[null,{"$f":"B27+7","v":"2013-07-14"},{"$f":"B28+1","v":"2013-07-15"},"2013-07-16","2013-07-17","2013-07-18","2013-07-19","2013-07-20",null,{"$f":"J27+7","v":"2013-08-11"},{"$f":"J28+1","v":"2013-08-12"},"2013-08-13","2013-08-14","2013-08-15","2013-08-16","2013-08-17",null,{"$f":"R27+7","v":"2013-09-15"},{"$f":"R28+1","v":"2013-09-16"},"2013-09-17","2013-09-18","2013-09-19","2013-09-20","2013-09-21",null,null,{"$f":"IFERROR(INDEX(Table1[Start],SMALL(IF($AA$8=INT(Table1[Start]),MATCH(ROW(Table1[Start]),ROW(Table1[Start])),\"\"),ROW(A19))),\"\")","v":""},{"$f":"IFERROR(INDEX(Table1[Events],SMALL(IF($AA$8=INT(Table1[Start]),MATCH(ROW(Table1[Start]),ROW(Table1[Start])),\"\"),ROW(C19))),\"\")","v":""}]
[null,"2013-07-21",{"$f":"B29+1","v":"2013-07-22"},"2013-07-23","2013-07-24","2013-07-25","2013-07-26","2013-07-27",null,"2013-08-18",{"$f":"J29+1","v":"2013-08-19"},"2013-08-20","2013-08-21","2013-08-22","2013-08-23","2013-08-24",null,"2013-09-22",{"$f":"R29+1","v":"2013-09-23"},"2013-09-24","2013-09-25","2013-09-26","2013-09-27","2013-09-28",null,null,{"$f":"IFERROR(INDEX(Table1[Start],SMALL(IF($AA$8=INT(Table1[Start]),MATCH(ROW(Table1[Start]),ROW(Table1[Start])),\"\"),ROW(A20))),\"\")","v":""},{"$f":"IFERROR(INDEX(Table1[Events],SMALL(IF($AA$8=INT(Table1[Start]),MATCH(ROW(Table1[Start]),ROW(Table1[Start])),\"\"),ROW(C20))),\"\")","v":""}]
[null,"2013-07-28",{"$f":"B30+1","v":"2013-07-29"},"2013-07-30","2013-07-31","2013-08-01","2013-08-02","2013-08-03",null,"2013-08-25",{"$f":"J30+1","v":"2013-08-26"},"2013-08-27","2013-08-28","2013-08-29","2013-08-30","2013-08-31",null,"2013-09-29",{"$f":"R30+1","v":"2013-09-30"},"2013-10-01","2013-10-02","2013-10-03","2013-10-04","2013-10-05",null,null,{"$f":"IFERROR(INDEX(Table1[Start],SMALL(IF($AA$8=INT(Table1[Start]),MATCH(ROW(Table1[Start]),ROW(Table1[Start])),\"\"),ROW(A21))),\"\")","v":""},{"$f":"IFERROR(INDEX(Table1[Events],SMALL(IF($AA$8=INT(Table1[Start]),MATCH(ROW(Table1[Start]),ROW(Table1[Start])),\"\"),ROW(C21))),\"\")","v":""}]
[null,"2013-08-04",{"$f":"B31+1","v":"2013-08-05"},"2013-08-06","2013-08-07","2013-08-08","2013-08-09","2013-08-10",null,"2013-09-01",{"$f":"J31+1","v":"2013-09-02"},"2013-09-03","2013-09-04","2013-09-05","2013-09-06","2013-09-07",null,"2013-10-06",{"$f":"R31+1","v":"2013-10-07"},"2013-10-08","2013-10-09","2013-10-10","2013-10-11","2013-10-12",null,null,{"$f":"IFERROR(INDEX(Table1[Start],SMALL(IF($AA$8=INT(Table1[Start]),MATCH(ROW(Table1[Start]),ROW(Table1[Start])),\"\"),ROW(A22))),\"\")","v":""},{"$f":"IFERROR(INDEX(Table1[Events],SMALL(IF($AA$8=INT(Table1[Start]),MATCH(ROW(Table1[Start]),ROW(Table1[Start])),\"\"),ROW(C22))),\"\")","v":""}]
[null,null,null,null,null,null,null,null,null,null,null,null,null,null,null,null,null,null,null,null,null,null,null,null,null,null,{"$f":"IFERROR(INDEX(Table1[Start],SMALL(IF($AA$8=INT(Table1[Start]),MATCH(ROW(Table1[Start]),ROW(Table1[Start])),\"\"),ROW(A23))),\"\")","v":""},{"$f":"IFERROR(INDEX(Table1[Events],SMALL(IF($AA$8=INT(Table1[Start]),MATCH(ROW(Table1[Start]),ROW(Table1[Start])),\"\"),ROW(C23))),\"\")","v":""}]
[null,"Oct",null,null,null,null,null,null,null,"Nov",null,null,null,null,null,null,null,"Dec",null,null,null,null,null,null,null,null,{"$f":"IFERROR(INDEX(Table1[Start],SMALL(IF($AA$8=INT(Table1[Start]),MATCH(ROW(Table1[Start]),ROW(Table1[Start])),\"\"),ROW(A24))),\"\")","v":""},{"$f":"IFERROR(INDEX(Table1[Events],SMALL(IF($AA$8=INT(Table1[Start]),MATCH(ROW(Table1[Start]),ROW(Table1[Start])),\"\"),ROW(C24))),\"\")","v":""}]
[null,"Su","Mo","Tu","We","Th","Fr","Sa",null,"Su","Mo","Tu","We","Th","Fr","Sa",null,"Su","Mo","Tu","We","Th","Fr","Sa",null,null,{"$f":"IFERROR(INDEX(Table1[Start],SMALL(IF($AA$8=INT(Table1[Start]),MATCH(ROW(Table1[Start]),ROW(Table1[Start])),\"\"),ROW(A25))),\"\")","v":""},{"$f":"IFERROR(INDEX(Table1[Events],SMALL(IF($AA$8=INT(Table1[Start]),MATCH(ROW(Table1[Start]),ROW(Table1[Start])),\"\"),ROW(C25))),\"\")","v":""}]
[null,{"$f":"DATE($K$2,10,1)-WEEKDAY(DATE($K$2,10,1),1)+1","v":"2013-09-29"},{"$f":"B35+1","v":"2013-09-30"},{"$f":"C35+1","v":"2013-10-01"},"2013-10-02","2013-10-03","2013-10-04","2013-10-05",null,{"$f":"DATE($K$2,11,1)-WEEKDAY(DATE($K$2,11,1),1)+1","v":"2013-10-27"},{"$f":"J35+1","v":"2013-10-28"},{"$f":"K35+1","v":"2013-10-29"},"2013-10-30","2013-10-31","2013-11-01","2013-11-02",null,{"$f":"DATE($K$2,12,1)-WEEKDAY(DATE($K$2,12,1),1)+1","v":"2013-12-01"},{"$f":"R35+1","v":"2013-12-02"},{"$f":"S35+1","v":"2013-12-03"},"2013-12-04","2013-12-05","2013-12-06","2013-12-07",null,null,{"$f":"IFERROR(INDEX(Table1[Start],SMALL(IF($AA$8=INT(Table1[Start]),MATCH(ROW(Table1[Start]),ROW(Table1[Start])),\"\"),ROW(A26))),\"\")","v":""},{"$f":"IFERROR(INDEX(Table1[Events],SMALL(IF($AA$8=INT(Table1[Start]),MATCH(ROW(Table1[Start]),ROW(Table1[Start])),\"\"),ROW(C26))),\"\")","v":""}]
[null,{"$f":"B35+7","v":"2013-10-06"},{"$f":"B36+1","v":"2013-10-07"},"2013-10-08","2013-10-09","2013-10-10","2013-10-11","2013-10-12",null,{"$f":"J35+7","v":"2013-11-03"},{"$f":"J36+1","v":"2013-11-04"},"2013-11-05","2013-11-06","2013-11-07","2013-11-08","2013-11-09",null,{"$f":"R35+7","v":"2013-12-08"},{"$f":"R36+1","v":"2013-12-09"},"2013-12-10","2013-12-11","2013-12-12","2013-12-13","2013-12-14",null,null,{"$f":"IFERROR(INDEX(Table1[Start],SMALL(IF($AA$8=INT(Table1[Start]),MATCH(ROW(Table1[Start]),ROW(Table1[Start])),\"\"),ROW(A27))),\"\")","v":""},{"$f":"IFERROR(INDEX(Table1[Events],SMALL(IF($AA$8=INT(Table1[Start]),MATCH(ROW(Table1[Start]),ROW(Table1[Start])),\"\"),ROW(C27))),\"\")","v":""}]
[null,{"$f":"B36+7","v":"2013-10-13"},{"$f":"B37+1","v":"2013-10-14"},"2013-10-15","2013-10-16","2013-10-17","2013-10-18","2013-10-19",null,{"$f":"J36+7","v":"2013-11-10"},{"$f":"J37+1","v":"2013-11-11"},"2013-11-12","2013-11-13","2013-11-14","2013-11-15","2013-11-16",null,{"$f":"R36+7","v":"2013-12-15"},{"$f":"R37+1","v":"2013-12-16"},"2013-12-17","2013-12-18","2013-12-19","2013-12-20","2013-12-21",null,null,{"$f":"IFERROR(INDEX(Table1[Start],SMALL(IF($AA$8=INT(Table1[Start]),MATCH(ROW(Table1[Start]),ROW(Table1[Start])),\"\"),ROW(A28))),\"\")","v":""},{"$f":"IFERROR(INDEX(Table1[Events],SMALL(IF($AA$8=INT(Table1[Start]),MATCH(ROW(Table1[Start]),ROW(Table1[Start])),\"\"),ROW(C28))),\"\")","v":""}]
[null,"2013-10-20",{"$f":"B38+1","v":"2013-10-21"},"2013-10-22","2013-10-23","2013-10-24","2013-10-25","2013-10-26",null,"2013-11-17",{"$f":"J38+1","v":"2013-11-18"},"2013-11-19","2013-11-20","2013-11-21","2013-11-22","2013-11-23",null,"2013-12-22",{"$f":"R38+1","v":"2013-12-23"},"2013-12-24","2013-12-25","2013-12-26","2013-12-27","2013-12-28",null,null,{"$f":"IFERROR(INDEX(Table1[Start],SMALL(IF($AA$8=INT(Table1[Start]),MATCH(ROW(Table1[Start]),ROW(Table1[Start])),\"\"),ROW(A29))),\"\")","v":""},{"$f":"IFERROR(INDEX(Table1[Events],SMALL(IF($AA$8=INT(Table1[Start]),MATCH(ROW(Table1[Start]),ROW(Table1[Start])),\"\"),ROW(C29))),\"\")","v":""}]
[null,"2013-10-27",{"$f":"B39+1","v":"2013-10-28"},"2013-10-29","2013-10-30","2013-10-31","2013-11-01","2013-11-02",null,"2013-11-24",{"$f":"J39+1","v":"2013-11-25"},"2013-11-26","2013-11-27","2013-11-28","2013-11-29","2013-11-30",null,"2013-12-29",{"$f":"R39+1","v":"2013-12-30"},"2013-12-31","2014-01-01","2014-01-02","2014-01-03","2014-01-04",null,null,{"$f":"IFERROR(INDEX(Table1[Start],SMALL(IF($AA$8=INT(Table1[Start]),MATCH(ROW(Table1[Start]),ROW(Table1[Start])),\"\"),ROW(A30))),\"\")","v":""},{"$f":"IFERROR(INDEX(Table1[Events],SMALL(IF($AA$8=INT(Table1[Start]),MATCH(ROW(Table1[Start]),ROW(Table1[Start])),\"\"),ROW(C30))),\"\")","v":""}]
[null,"2013-11-03",{"$f":"B40+1","v":"2013-11-04"},"2013-11-05","2013-11-06","2013-11-07","2013-11-08","2013-11-09",null,"2013-12-01",{"$f":"J40+1","v":"2013-12-02"},"2013-12-03","2013-12-04","2013-12-05","2013-12-06","2013-12-07",null,"2014-01-05",{"$f":"R40+1","v":"2014-01-06"},"2014-01-07","2014-01-08","2014-01-09","2014-01-10","2014-01-11",null,null,{"$f":"IFERROR(INDEX(Table1[Start],SMALL(IF($AA$8=INT(Table1[Start]),MATCH(ROW(Table1[Start]),ROW(Table1[Start])),\"\"),ROW(A31))),\"\")","v":""},{"$f":"IFERROR(INDEX(Table1[Events],SMALL(IF($AA$8=INT(Table1[Start]),MATCH(ROW(Table1[Start]),ROW(Table1[Start])),\"\"),ROW(C31))),\"\")","v":""}]

{"sheet":"Month","index":1,"n_rows":37,"n_cols":20,"rows_kept":37,"cut":false,"hidden":false,"merged":[[1,2,1,13],[12,17,12,20],[6,17,6,20],[5,16,5,20],[6,1,6,2],[6,3,6,4],[6,5,6,6],[6,7,6,8],[6,9,6,10],[6,11,6,12],[6,13,6,14],[7,17,7,20],[8,17,8,20],[9,17,9,20],[10,17,10,20],[11,17,11,20],[24,17,24,20],[13,17,13,20],[14,17,14,20],[15,17,15,20],[16,17,16,20],[17,17,17,20],[18,17,18,20],[19,17,19,20],[20,17,20,20],[21,17,21,20],[22,17,22,20],[23,17,23,20],[36,17,36,20],[25,17,25,20],[26,17,26,20],[27,17,27,20],[28,17,28,20],[29,17,29,20],[30,17,30,20],[31,17,31,20],[32,17,32,20],[33,17,33,20],[34,17,34,20],[35,17,35,20]]}
[]
[null,null,{"$f":"O4&\" \"&O5","v":"Feb 2013"}]
[]
[null,null,"Jan","Feb","Mar","Apr","May","Jun","Jul","Aug","Sep","Oct","Nov","Dec","Feb",{"$f":"MATCH(O4,{\"Jan\",\"Feb\",\"Mar\",\"Apr\",\"May\",\"Jun\",\"Jul\",\"Aug\",\"Sep\",\"Oct\",\"Nov\",\"Dec\"},0)","v":2},"Year","Month","Day","Table"]
[null,null,{"$f":"YEAR(TODAY())-2","v":2011},{"$f":"YEAR(TODAY())-1","v":2012},{"$f":"YEAR(TODAY())","v":2013},{"$f":"YEAR(TODAY())+1","v":2014},{"$f":"YEAR(TODAY())+2","v":2015},{"$f":"YEAR(TODAY())+3","v":2016},{"$f":"YEAR(TODAY())+4","v":2017},{"$f":"YEAR(TODAY())+5","v":2018},{"$f":"YEAR(TODAY())+6","v":2019},{"$f":"YEAR(TODAY())+7","v":2020},{"$f":"YEAR(TODAY())+8","v":2021},{"$f":"YEAR(TODAY())+9","v":2022},2013]
[]
[null,"Sunday",null,"Monday",null,"Tuesday",null,"Wednesday",null,"Thursday",null,"Friday",null,"Saturday",null,null,"Time","Event"]
[null,{"$f":"DATE(O5,MATCH(O4,{\"Jan\",\"Feb\",\"Mar\",\"Apr\",\"May\",\"Jun\",\"Jul\",\"Aug\",\"Sep\",\"Oct\",\"Nov\",\"Dec\"},0),1)-WEEKDAY(DATE(O5,MATCH(O4,{\"Jan\",\"Feb\",\"Mar\",\"Apr\",\"May\",\"Jun\",\"Jul\",\"Aug\",\"Sep\",\"Oct\",\"Nov\",\"Dec\"},0),1))+1","v":"2013-01-27"},null,{"$f":"B8+1","v":"2013-01-28"},null,{"$f":"D8+1","v":"2013-01-29"},null,{"$f":"F8+1","v":"2013-01-30"},null,{"$f":"H8+1","v":"2013-01-31"},null,{"$f":"J8+1","v":"2013-02-01"},null,{"$f":"L8+1","v":"2013-02-02"},null,null,{"$f":"IFERROR(INDEX(Table1[Start],SMALL(IF(INT(Table1[Start])=Month!$Q$6,MATCH(ROW(Table1[Start]),ROW(Table1[Start])),\"\"),ROW(A1))),\"\")","v":""},{"$f":"IFERROR(INDEX(Table1[Events],SMALL(IF(INT(Table1[Start])=Month!$Q$6,MATCH(ROW(Table1[Start]),ROW(Table1[Start])),\"\"),ROW(A1))),\"\")","v":""}]
[null,{"$f":"IFERROR(INDEX(Table1[Start],SMALL(IF(Month!B$8=INT(Table1[Start]),MATCH(ROW(Table1[Start]),ROW(Table1[Start])),\"\"),ROW(A1))),\"\")","v":""},{"$f":"IFERROR(LEFT(INDEX(Table1[Events],SMALL(IF(Month!B$8=INT(Table1[Start]),MATCH(ROW(Table1[Start]),ROW(Table1[Start])),\"\"),ROW(A1))),15),\"\")","v":""},{"$f":"IFERROR(INDEX(Table1[Start],SMALL(IF(Month!D$8=INT(Table1[Start]),MATCH(ROW(Table1[Start]),ROW(Table1[Start])),\"\"),ROW(C1))),\"\")","v":""},{"$f":"IFERROR(LEFT(INDEX(Table1[Events],SMALL(IF(Month!D$8=INT(Table1[Start]),MATCH(ROW(Table1[Start]),ROW(Table1[Start])),\"\"),ROW(C1))),15),\"\")","v":""},{"$f":"IFERROR(INDEX(Table1[Start],SMALL(IF(Month!F$8=INT(Table1[Start]),MATCH(ROW(Table1[Start]),ROW(Table1[Start])),\"\"),ROW(E1))),\"\")","v":""},{"$f":"IFERROR(LEFT(INDEX(Table1[Events],SMALL(IF(Month!F$8=INT(Table1[Start]),MATCH(ROW(Table1[Start]),ROW(Table1[Start])),\"\"),ROW(E1))),15),\"\")","v":""},{"$f":"IFERROR(INDEX(Table1[Start],SMALL(IF(Month!H$8=INT(Table1[Start]),MATCH(ROW(Table1[Start]),ROW(Table1[Start])),\"\"),ROW(G1))),\"\")","v":""},{"$f":"IFERROR(LEFT(INDEX(Table1[Events],SMALL(IF(Month!H$8=INT(Table1[Start]),MATCH(ROW(Table1[Start]),ROW(Table1[Start])),\"\"),ROW(G1))),15),\"\")","v":""},{"$f":"IFERROR(INDEX(Table1[Start],SMALL(IF(Month!J$8=INT(Table1[Start]),MATCH(ROW(Table1[Start]),ROW(Table1[Start])),\"\"),ROW(I1))),\"\")","v":""},{"$f":"IFERROR(LEFT(INDEX(Table1[Events],SMALL(IF(Month!J$8=INT(Table1[Start]),MATCH(ROW(Table1[Start]),ROW(Table1[Start])),\"\"),ROW(I1))),15),\"\")","v":""},{"$f":"IFERROR(INDEX(Table1[Start],SMALL(IF(Month!L$8=INT(Table1[Start]),MATCH(ROW(Table1[Start]),ROW(Table1[Start])),\"\"),ROW(K1))),\"\")","v":""},{"$f":"IFERROR(LEFT(INDEX(Table1[Events],SMALL(IF(Month!L$8=INT(Table1[Start]),MATCH(ROW(Table1[Start]),ROW(Table1[Start])),\"\"),ROW(K1))),15),\"\")","v":""},{"$f":"IFERROR(INDEX(Table1[Start],SMALL(IF(Month!N$8=INT(Table1[Start]),MATCH(ROW(Table1[Start]),ROW(Table1[Start])),\"\"),ROW(M1))),\"\")","v":""},{"$f":"IFERROR(LEFT(INDEX(Table1[Events],SMALL(IF(Month!N$8=INT(Table1[Start]),MATCH(ROW(Table1[Start]),ROW(Table1[Start])),\"\"),ROW(M1))),15),\"\")","v":""},null,{"$f":"IFERROR(INDEX(Table1[Start],SMALL(IF(INT(Table1[Start])=Month!$Q$6,MATCH(ROW(Table1[Start]),ROW(Table1[Start])),\"\"),ROW(A2))),\"\")","v":""},{"$f":"IFERROR(INDEX(Table1[Events],SMALL(IF(INT(Table1[Start])=Month!$Q$6,MATCH(ROW(Table1[Start]),ROW(Table1[Start])),\"\"),ROW(A2))),\"\")","v":""}]
[null,{"$f":"IFERROR(INDEX(Table1[Start],SMALL(IF(Month!B$8=INT(Table1[Start]),MATCH(ROW(Table1[Start]),ROW(Table1[Start])),\"\"),ROW(A2))),\"\")","v":""},{"$f":"IFERROR(LEFT(INDEX(Table1[Events],SMALL(IF(Month!B$8=INT(Table1[Start]),MATCH(ROW(Table1[Start]),ROW(Table1[Start])),\"\"),ROW(A2))),15),\"\")","v":""},{"$f":"IFERROR(INDEX(Table1[Start],SMALL(IF(Month!D$8=INT(Table1[Start]),MATCH(ROW(Table1[Start]),ROW(Table1[Start])),\"\"),ROW(C2))),\"\")","v":""},{"$f":"IFERROR(LEFT(INDEX(Table1[Events],SMALL(IF(Month!D$8=INT(Table1[Start]),MATCH(ROW(Table1[Start]),ROW(Table1[Start])),\"\"),ROW(C2))),15),\"\")","v":""},{"$f":"IFERROR(INDEX(Table1[Start],SMALL(IF(Month!F$8=INT(Table1[Start]),MATCH(ROW(Table1[Start]),ROW(Table1[Start])),\"\"),ROW(E2))),\"\")","v":""},{"$f":"IFERROR(LEFT(INDEX(Table1[Events],SMALL(IF(Month!F$8=INT(Table1[Start]),MATCH(ROW(Table1[Start]),ROW(Table1[Start])),\"\"),ROW(E2))),15),\"\")","v":""},{"$f":"IFERROR(INDEX(Table1[Start],SMALL(IF(Month!H$8=INT(Table1[Start]),MATCH(ROW(Table1[Start]),ROW(Table1[Start])),\"\"),ROW(G2))),\"\")","v":""},{"$f":"IFERROR(LEFT(INDEX(Table1[Events],SMALL(IF(Month!H$8=INT(Table1[Start]),MATCH(ROW(Table1[Start]),ROW(Table1[Start])),\"\"),ROW(G2))),15),\"\")","v":""},{"$f":"IFERROR(INDEX(Table1[Start],SMALL(IF(Month!J$8=INT(Table1[Start]),MATCH(ROW(Table1[Start]),ROW(Table1[Start])),\"\"),ROW(I2))),\"\")","v":""},{"$f":"IFERROR(LEFT(INDEX(Table1[Events],SMALL(IF(Month!J$8=INT(Table1[Start]),MATCH(ROW(Table1[Start]),ROW(Table1[Start])),\"\"),ROW(I2))),15),\"\")","v":""},{"$f":"IFERROR(INDEX(Table1[Start],SMALL(IF(Month!L$8=INT(Table1[Start]),MATCH(ROW(Table1[Start]),ROW(Table1[Start])),\"\"),ROW(K2))),\"\")","v":""},{"$f":"IFERROR(LEFT(INDEX(Table1[Events],SMALL(IF(Month!L$8=INT(Table1[Start]),MATCH(ROW(Table1[Start]),ROW(Table1[Start])),\"\"),ROW(K2))),15),\"\")","v":""},{"$f":"IFERROR(INDEX(Table1[Start],SMALL(IF(Month!N$8=INT(Table1[Start]),MATCH(ROW(Table1[Start]),ROW(Table1[Start])),\"\"),ROW(M2))),\"\")","v":""},{"$f":"IFERROR(LEFT(INDEX(Table1[Events],SMALL(IF(Month!N$8=INT(Table1[Start]),MATCH(ROW(Table1[Start]),ROW(Table1[Start])),\"\"),ROW(M2))),15),\"\")","v":""},null,{"$f":"IFERROR(INDEX(Table1[Start],SMALL(IF(INT(Table1[Start])=Month!$Q$6,MATCH(ROW(Table1[Start]),ROW(Table1[Start])),\"\"),ROW(A3))),\"\")","v":""},{"$f":"IFERROR(INDEX(Table1[Events],SMALL(IF(INT(Table1[Start])=Month!$Q$6,MATCH(ROW(Table1[Start]),ROW(Table1[Start])),\"\"),ROW(A3))),\"\")","v":""}]
[null,{"$f":"IFERROR(INDEX(Table1[Start],SMALL(IF(Month!B$8=INT(Table1[Start]),MATCH(ROW(Table1[Start]),ROW(Table1[Start])),\"\"),ROW(A3))),\"\")","v":""},{"$f":"IFERROR(LEFT(INDEX(Table1[Events],SMALL(IF(Month!B$8=INT(Table1[Start]),MATCH(ROW(Table1[Start]),ROW(Table1[Start])),\"\"),ROW(A3))),15),\"\")","v":""},{"$f":"IFERROR(INDEX(Table1[Start],SMALL(IF(Month!D$8=INT(Table1[Start]),MATCH(ROW(Table1[Start]),ROW(Table1[Start])),\"\"),ROW(C3))),\"\")","v":""},{"$f":"IFERROR(LEFT(INDEX(Table1[Events],SMALL(IF(Month!D$8=INT(Table1[Start]),MATCH(ROW(Table1[Start]),ROW(Table1[Start])),\"\"),ROW(C3))),15),\"\")","v":""},{"$f":"IFERROR(INDEX(Table1[Start],SMALL(IF(Month!F$8=INT(Table1[Start]),MATCH(ROW(Table1[Start]),ROW(Table1[Start])),\"\"),ROW(E3))),\"\")","v":""},{"$f":"IFERROR(LEFT(INDEX(Table1[Events],SMALL(IF(Month!F$8=INT(Table1[Start]),MATCH(ROW(Table1[Start]),ROW(Table1[Start])),\"\"),ROW(E3))),15),\"\")","v":""},{"$f":"IFERROR(INDEX(Table1[Start],SMALL(IF(Month!H$8=INT(Table1[Start]),MATCH(ROW(Table1[Start]),ROW(Table1[Start])),\"\"),ROW(G3))),\"\")","v":""},{"$f":"IFERROR(LEFT(INDEX(Table1[Events],SMALL(IF(Month!H$8=INT(Table1[Start]),MATCH(ROW(Table1[Start]),ROW(Table1[Start])),\"\"),ROW(G3))),15),\"\")","v":""},{"$f":"IFERROR(INDEX(Table1[Start],SMALL(IF(Month!J$8=INT(Table1[Start]),MATCH(ROW(Table1[Start]),ROW(Table1[Start])),\"\"),ROW(I3))),\"\")","v":""},{"$f":"IFERROR(LEFT(INDEX(Table1[Events],SMALL(IF(Month!J$8=INT(Table1[Start]),MATCH(ROW(Table1[Start]),ROW(Table1[Start])),\"\"),ROW(I3))),15),\"\")","v":""},{"$f":"IFERROR(INDEX(Table1[Start],SMALL(IF(Month!L$8=INT(Table1[Start]),MATCH(ROW(Table1[Start]),ROW(Table1[Start])),\"\"),ROW(K3))),\"\")","v":""},{"$f":"IFERROR(LEFT(INDEX(Table1[Events],SMALL(IF(Month!L$8=INT(Table1[Start]),MATCH(ROW(Table1[Start]),ROW(Table1[Start])),\"\"),ROW(K3))),15),\"\")","v":""},{"$f":"IFERROR(INDEX(Table1[Start],SMALL(IF(Month!N$8=INT(Table1[Start]),MATCH(ROW(Table1[Start]),ROW(Table1[Start])),\"\"),ROW(M3))),\"\")","v":""},{"$f":"IFERROR(LEFT(INDEX(Table1[Events],SMALL(IF(Month!N$8=INT(Table1[Start]),MATCH(ROW(Table1[Start]),ROW(Table1[Start])),\"\"),ROW(M3))),15),\"\")","v":""},null,{"$f":"IFERROR(INDEX(Table1[Start],SMALL(IF(INT(Table1[Start])=Month!$Q$6,MATCH(ROW(Table1[Start]),ROW(Table1[Start])),\"\"),ROW(A4))),\"\")","v":""},{"$f":"IFERROR(INDEX(Table1[Events],SMALL(IF(INT(Table1[Start])=Month!$Q$6,MATCH(ROW(Table1[Start]),ROW(Table1[Start])),\"\"),ROW(A4))),\"\")","v":""}]
[null,{"$f":"IFERROR(INDEX(Table1[Start],SMALL(IF(Month!B$8=INT(Table1[Start]),MATCH(ROW(Table1[Start]),ROW(Table1[Start])),\"\"),ROW(A4))),\"\")","v":""},{"$f":"IFERROR(LEFT(INDEX(Table1[Events],SMALL(IF(Month!B$8=INT(Table1[Start]),MATCH(ROW(Table1[Start]),ROW(Table1[Start])),\"\"),ROW(A4))),15),\"\")","v":""},{"$f":"IFERROR(INDEX(Table1[Start],SMALL(IF(Month!D$8=INT(Table1[Start]),MATCH(ROW(Table1[Start]),ROW(Table1[Start])),\"\"),ROW(C4))),\"\")","v":""},{"$f":"IFERROR(LEFT(INDEX(Table1[Events],SMALL(IF(Month!D$8=INT(Table1[Start]),MATCH(ROW(Table1[Start]),ROW(Table1[Start])),\"\"),ROW(C4))),15),\"\")","v":""},{"$f":"IFERROR(INDEX(Table1[Start],SMALL(IF(Month!F$8=INT(Table1[Start]),MATCH(ROW(Table1[Start]),ROW(Table1[Start])),\"\"),ROW(E4))),\"\")","v":""},{"$f":"IFERROR(LEFT(INDEX(Table1[Events],SMALL(IF(Month!F$8=INT(Table1[Start]),MATCH(ROW(Table1[Start]),ROW(Table1[Start])),\"\"),ROW(E4))),15),\"\")","v":""},{"$f":"IFERROR(INDEX(Table1[Start],SMALL(IF(Month!H$8=INT(Table1[Start]),MATCH(ROW(Table1[Start]),ROW(Table1[Start])),\"\"),ROW(G4))),\"\")","v":""},{"$f":"IFERROR(LEFT(INDEX(Table1[Events],SMALL(IF(Month!H$8=INT(Table1[Start]),MATCH(ROW(Table1[Start]),ROW(Table1[Start])),\"\"),ROW(G4))),15),\"\")","v":""},{"$f":"IFERROR(INDEX(Table1[Start],SMALL(IF(Month!J$8=INT(Table1[Start]),MATCH(ROW(Table1[Start]),ROW(Table1[Start])),\"\"),ROW(I4))),\"\")","v":""},{"$f":"IFERROR(LEFT(INDEX(Table1[Events],SMALL(IF(Month!J$8=INT(Table1[Start]),MATCH(ROW(Table1[Start]),ROW(Table1[Start])),\"\"),ROW(I4))),15),\"\")","v":""},{"$f":"IFERROR(INDEX(Table1[Start],SMALL(IF(Month!L$8=INT(Table1[Start]),MATCH(ROW(Table1[Start]),ROW(Table1[Start])),\"\"),ROW(K4))),\"\")","v":""},{"$f":"IFERROR(LEFT(INDEX(Table1[Events],SMALL(IF(Month!L$8=INT(Table1[Start]),MATCH(ROW(Table1[Start]),ROW(Table1[Start])),\"\"),ROW(K4))),15),\"\")","v":""},{"$f":"IFERROR(INDEX(Table1[Start],SMALL(IF(Month!N$8=INT(Table1[Start]),MATCH(ROW(Table1[Start]),ROW(Table1[Start])),\"\"),ROW(M4))),\"\")","v":""},{"$f":"IFERROR(LEFT(INDEX(Table1[Events],SMALL(IF(Month!N$8=INT(Table1[Start]),MATCH(ROW(Table1[Start]),ROW(Table1[Start])),\"\"),ROW(M4))),15),\"\")","v":""},null,{"$f":"IFERROR(INDEX(Table1[Start],SMALL(IF(INT(Table1[Start])=Month!$Q$6,MATCH(ROW(Table1[Start]),ROW(Table1[Start])),\"\"),ROW(A5))),\"\")","v":""},{"$f":"IFERROR(INDEX(Table1[Events],SMALL(IF(INT(Table1[Start])=Month!$Q$6,MATCH(ROW(Table1[Start]),ROW(Table1[Start])),\"\"),ROW(A5))),\"\")","v":""}]
[null,{"$f":"B8+7","v":"2013-02-03"},null,{"$f":"B13+1","v":"2013-02-04"},null,{"$f":"D13+1","v":"2013-02-05"},null,{"$f":"F13+1","v":"2013-02-06"},null,{"$f":"H13+1","v":"2013-02-07"},null,{"$f":"J13+1","v":"2013-02-08"},null,{"$f":"L13+1","v":"2013-02-09"},null,null,{"$f":"IFERROR(INDEX(Table1[Start],SMALL(IF(INT(Table1[Start])=Month!$Q$6,MATCH(ROW(Table1[Start]),ROW(Table1[Start])),\"\"),ROW(A6))),\"\")","v":""},{"$f":"IFERROR(INDEX(Table1[Events],SMALL(IF(INT(Table1[Start])=Month!$Q$6,MATCH(ROW(Table1[Start]),ROW(Table1[Start])),\"\"),ROW(A6))),\"\")","v":""}]
[null,{"$f":"IFERROR(INDEX(Table1[Start],SMALL(IF(Month!B$13=INT(Table1[Start]),MATCH(ROW(Table1[Start]),ROW(Table1[Start])),\"\"),ROW(A1))),\"\")","v":""},{"$f":"IFERROR(LEFT(INDEX(Table1[Events],SMALL(IF(Month!B$13=INT(Table1[Start]),MATCH(ROW(Table1[Start]),ROW(Table1[Start])),\"\"),ROW(A1))),15),\"\")","v":""},{"$f":"IFERROR(INDEX(Table1[Start],SMALL(IF(Month!D$13=INT(Table1[Start]),MATCH(ROW(Table1[Start]),ROW(Table1[Start])),\"\"),ROW(C1))),\"\")","v":""},{"$f":"IFERROR(LEFT(INDEX(Table1[Events],SMALL(IF(Month!D$13=INT(Table1[Start]),MATCH(ROW(Table1[Start]),ROW(Table1[Start])),\"\"),ROW(C1))),15),\"\")","v":""},{"$f":"IFERROR(INDEX(Table1[Start],SMALL(IF(Month!F$13=INT(Table1[Start]),MATCH(ROW(Table1[Start]),ROW(Table1[Start])),\"\"),ROW(E1))),\"\")","v":""},{"$f":"IFERROR(LEFT(INDEX(Table1[Events],SMALL(IF(Month!F$13=INT(Table1[Start]),MATCH(ROW(Table1[Start]),ROW(Table1[Start])),\"\"),ROW(E1))),15),\"\")","v":""},{"$f":"IFERROR(INDEX(Table1[Start],SMALL(IF(Month!H$13=INT(Table1[Start]),MATCH(ROW(Table1[Start]),ROW(Table1[Start])),\"\"),ROW(G1))),\"\")","v":""},{"$f":"IFERROR(LEFT(INDEX(Table1[Events],SMALL(IF(Month!H$13=INT(Table1[Start]),MATCH(ROW(Table1[Start]),ROW(Table1[Start])),\"\"),ROW(G1))),15),\"\")","v":""},{"$f":"IFERROR(INDEX(Table1[Start],SMALL(IF(Month!J$13=INT(Table1[Start]),MATCH(ROW(Table1[Start]),ROW(Table1[Start])),\"\"),ROW(I1))),\"\")","v":41312.333333333336},{"$f":"IFERROR(LEFT(INDEX(Table1[Events],SMALL(IF(Month!J$13=INT(Table1[Start]),MATCH(ROW(Table1[Start]),ROW(Table1[Start])),\"\"),ROW(I1))),15),\"\")","v":"Event 3"},{"$f":"IFERROR(INDEX(Table1[Start],SMALL(IF(Month!L$13=INT(Table1[Start]),MATCH(ROW(Table1[Start]),ROW(Table1[Start])),\"\"),ROW(K1))),\"\")","v":41313.333333333336},{"$f":"IFERROR(LEFT(INDEX(Table1[Events],SMALL(IF(Month!L$13=INT(Table1[Start]),MATCH(ROW(Table1[Start]),ROW(Table1[Start])),\"\"),ROW(K1))),15),\"\")","v":"Event 12"},{"$f":"IFERROR(INDEX(Table1[Start],SMALL(IF(Month!N$13=INT(Table1[Start]),MATCH(ROW(Table1[Start]),ROW(Table1[Start])),\"\"),ROW(M1))),\"\")","v":""},{"$f":"IFERROR(LEFT(INDEX(Table1[Events],SMALL(IF(Month!N$13=INT(Table1[Start]),MATCH(ROW(Table1[Start]),ROW(Table1[Start])),\"\"),ROW(M1))),15),\"\")","v":""},null,{"$f":"IFERROR(INDEX(Table1[Start],SMALL(IF(INT(Table1[Start])=Month!$Q$6,MATCH(ROW(Table1[Start]),ROW(Table1[Start])),\"\"),ROW(A7))),\"\")","v":""},{"$f":"IFERROR(INDEX(Table1[Events],SMALL(IF(INT(Table1[Start])=Month!$Q$6,MATCH(ROW(Table1[Start]),ROW(Table1[Start])),\"\"),ROW(A7))),\"\")","v":""}]
[null,{"$f":"IFERROR(INDEX(Table1[Start],SMALL(IF(Month!B$13=INT(Table1[Start]),MATCH(ROW(Table1[Start]),ROW(Table1[Start])),\"\"),ROW(A2))),\"\")","v":""},{"$f":"IFERROR(LEFT(INDEX(Table1[Events],SMALL(IF(Month!B$13=INT(Table1[Start]),MATCH(ROW(Table1[Start]),ROW(Table1[Start])),\"\"),ROW(A2))),15),\"\")","v":""},{"$f":"IFERROR(INDEX(Table1[Start],SMALL(IF(Month!D$13=INT(Table1[Start]),MATCH(ROW(Table1[Start]),ROW(Table1[Start])),\"\"),ROW(C2))),\"\")","v":""},{"$f":"IFERROR(LEFT(INDEX(Table1[Events],SMALL(IF(Month!D$13=INT(Table1[Start]),MATCH(ROW(Table1[Start]),ROW(Table1[Start])),\"\"),ROW(C2))),15),\"\")","v":""},{"$f":"IFERROR(INDEX(Table1[Start],SMALL(IF(Month!F$13=INT(Table1[Start]),MATCH(ROW(Table1[Start]),ROW(Table1[Start])),\"\"),ROW(E2))),\"\")","v":""},{"$f":"IFERROR(LEFT(INDEX(Table1[Events],SMALL(IF(Month!F$13=INT(Table1[Start]),MATCH(ROW(Table1[Start]),ROW(Table1[Start])),\"\"),ROW(E2))),15),\"\")","v":""},{"$f":"IFERROR(INDEX(Table1[Start],SMALL(IF(Month!H$13=INT(Table1[Start]),MATCH(ROW(Table1[Start]),ROW(Table1[Start])),\"\"),ROW(G2))),\"\")","v":""},{"$f":"IFERROR(LEFT(INDEX(Table1[Events],SMALL(IF(Month!H$13=INT(Table1[Start]),MATCH(ROW(Table1[Start]),ROW(Table1[Start])),\"\"),ROW(G2))),15),\"\")","v":""},{"$f":"IFERROR(INDEX(Table1[Start],SMALL(IF(Month!J$13=INT(Table1[Start]),MATCH(ROW(Table1[Start]),ROW(Table1[Start])),\"\"),ROW(I2))),\"\")","v":41312.375},{"$f":"IFERROR(LEFT(INDEX(Table1[Events],SMALL(IF(Month!J$13=INT(Table1[Start]),MATCH(ROW(Table1[Start]),ROW(Table1[Start])),\"\"),ROW(I2))),15),\"\")","v":"Event 11"},{"$f":"IFERROR(INDEX(Table1[Start],SMALL(IF(Month!L$13=INT(Table1[Start]),MATCH(ROW(Table1[Start]),ROW(Table1[Start])),\"\"),ROW(K2))),\"\")","v":41313.416666666664},{"$f":"IFERROR(LEFT(INDEX(Table1[Events],SMALL(IF(Month!L$13=INT(Table1[Start]),MATCH(ROW(Table1[Start]),ROW(Table1[Start])),\"\"),ROW(K2))),15),\"\")","v":"Event 13"},{"$f":"IFERROR(INDEX(Table1[Start],SMALL(IF(Month!N$13=INT(Table1[Start]),MATCH(ROW(Table1[Start]),ROW(Table1[Start])),\"\"),ROW(M2))),\"\")","v":""},{"$f":"IFERROR(LEFT(INDEX(Table1[Events],SMALL(IF(Month!N$13=INT(Table1[Start]),MATCH(ROW(Table1[Start]),ROW(Table1[Start])),\"\"),ROW(M2))),15),\"\")","v":""},null,{"$f":"IFERROR(INDEX(Table1[Start],SMALL(IF(INT(Table1[Start])=Month!$Q$6,MATCH(ROW(Table1[Start]),ROW(Table1[Start])),\"\"),ROW(A8))),\"\")","v":""},{"$f":"IFERROR(INDEX(Table1[Events],SMALL(IF(INT(Table1[Start])=Month!$Q$6,MATCH(ROW(Table1[Start]),ROW(Table1[Start])),\"\"),ROW(A8))),\"\")","v":""}]
[null,{"$f":"IFERROR(INDEX(Table1[Start],SMALL(IF(Month!B$13=INT(Table1[Start]),MATCH(ROW(Table1[Start]),ROW(Table1[Start])),\"\"),ROW(A3))),\"\")","v":""},{"$f":"IFERROR(LEFT(INDEX(Table1[Events],SMALL(IF(Month!B$13=INT(Table1[Start]),MATCH(ROW(Table1[Start]),ROW(Table1[Start])),\"\"),ROW(A3))),15),\"\")","v":""},{"$f":"IFERROR(INDEX(Table1[Start],SMALL(IF(Month!D$13=INT(Table1[Start]),MATCH(ROW(Table1[Start]),ROW(Table1[Start])),\"\"),ROW(C3))),\"\")","v":""},{"$f":"IFERROR(LEFT(INDEX(Table1[Events],SMALL(IF(Month!D$13=INT(Table1[Start]),MATCH(ROW(Table1[Start]),ROW(Table1[Start])),\"\"),ROW(C3))),15),\"\")","v":""},{"$f":"IFERROR(INDEX(Table1[Start],SMALL(IF(Month!F$13=INT(Table1[Start]),MATCH(ROW(Table1[Start]),ROW(Table1[Start])),\"\"),ROW(E3))),\"\")","v":""},{"$f":"IFERROR(LEFT(INDEX(Table1[Events],SMALL(IF(Month!F$13=INT(Table1[Start]),MATCH(ROW(Table1[Start]),ROW(Table1[Start])),\"\"),ROW(E3))),15),\"\")","v":""},{"$f":"IFERROR(INDEX(Table1[Start],SMALL(IF(Month!H$13=INT(Table1[Start]),MATCH(ROW(Table1[Start]),ROW(Table1[Start])),\"\"),ROW(G3))),\"\")","v":""},{"$f":"IFERROR(LEFT(INDEX(Table1[Events],SMALL(IF(Month!H$13=INT(Table1[Start]),MATCH(ROW(Table1[Start]),ROW(Table1[Start])),\"\"),ROW(G3))),15),\"\")","v":""},{"$f":"IFERROR(INDEX(Table1[Start],SMALL(IF(Month!J$13=INT(Table1[Start]),MATCH(ROW(Table1[Start]),ROW(Table1[Start])),\"\"),ROW(I3))),\"\")","v":""},{"$f":"IFERROR(LEFT(INDEX(Table1[Events],SMALL(IF(Month!J$13=INT(Table1[Start]),MATCH(ROW(Table1[Start]),ROW(Table1[Start])),\"\"),ROW(I3))),15),\"\")","v":""},{"$f":"IFERROR(INDEX(Table1[Start],SMALL(IF(Month!L$13=INT(Table1[Start]),MATCH(ROW(Table1[Start]),ROW(Table1[Start])),\"\"),ROW(K3))),\"\")","v":""},{"$f":"IFERROR(LEFT(INDEX(Table1[Events],SMALL(IF(Month!L$13=INT(Table1[Start]),MATCH(ROW(Table1[Start]),ROW(Table1[Start])),\"\"),ROW(K3))),15),\"\")","v":""},{"$f":"IFERROR(INDEX(Table1[Start],SMALL(IF(Month!N$13=INT(Table1[Start]),MATCH(ROW(Table1[Start]),ROW(Table1[Start])),\"\"),ROW(M3))),\"\")","v":""},{"$f":"IFERROR(LEFT(INDEX(Table1[Events],SMALL(IF(Month!N$13=INT(Table1[Start]),MATCH(ROW(Table1[Start]),ROW(Table1[Start])),\"\"),ROW(M3))),15),\"\")","v":""},null,{"$f":"IFERROR(INDEX(Table1[Start],SMALL(IF(INT(Table1[Start])=Month!$Q$6,MATCH(ROW(Table1[Start]),ROW(Table1[Start])),\"\"),ROW(A9))),\"\")","v":""},{"$f":"IFERROR(INDEX(Table1[Events],SMALL(IF(INT(Table1[Start])=Month!$Q$6,MATCH(ROW(Table1[Start]),ROW(Table1[Start])),\"\"),ROW(A9))),\"\")","v":""}]
[null,{"$f":"IFERROR(INDEX(Table1[Start],SMALL(IF(Month!B$13=INT(Table1[Start]),MATCH(ROW(Table1[Start]),ROW(Table1[Start])),\"\"),ROW(A4))),\"\")","v":""},{"$f":"IFERROR(LEFT(INDEX(Table1[Events],SMALL(IF(Month!B$13=INT(Table1[Start]),MATCH(ROW(Table1[Start]),ROW(Table1[Start])),\"\"),ROW(A4))),15),\"\")","v":""},{"$f":"IFERROR(INDEX(Table1[Start],SMALL(IF(Month!D$13=INT(Table1[Start]),MATCH(ROW(Table1[Start]),ROW(Table1[Start])),\"\"),ROW(C4))),\"\")","v":""},{"$f":"IFERROR(LEFT(INDEX(Table1[Events],SMALL(IF(Month!D$13=INT(Table1[Start]),MATCH(ROW(Table1[Start]),ROW(Table1[Start])),\"\"),ROW(C4))),15),\"\")","v":""},{"$f":"IFERROR(INDEX(Table1[Start],SMALL(IF(Month!F$13=INT(Table1[Start]),MATCH(ROW(Table1[Start]),ROW(Table1[Start])),\"\"),ROW(E4))),\"\")","v":""},{"$f":"IFERROR(LEFT(INDEX(Table1[Events],SMALL(IF(Month!F$13=INT(Table1[Start]),MATCH(ROW(Table1[Start]),ROW(Table1[Start])),\"\"),ROW(E4))),15),\"\")","v":""},{"$f":"IFERROR(INDEX(Table1[Start],SMALL(IF(Month!H$13=INT(Table1[Start]),MATCH(ROW(Table1[Start]),ROW(Table1[Start])),\"\"),ROW(G4))),\"\")","v":""},{"$f":"IFERROR(LEFT(INDEX(Table1[Events],SMALL(IF(Month!H$13=INT(Table1[Start]),MATCH(ROW(Table1[Start]),ROW(Table1[Start])),\"\"),ROW(G4))),15),\"\")","v":""},{"$f":"IFERROR(INDEX(Table1[Start],SMALL(IF(Month!J$13=INT(Table1[Start]),MATCH(ROW(Table1[Start]),ROW(Table1[Start])),\"\"),ROW(I4))),\"\")","v":""},{"$f":"IFERROR(LEFT(INDEX(Table1[Events],SMALL(IF(Month!J$13=INT(Table1[Start]),MATCH(ROW(Table1[Start]),ROW(Table1[Start])),\"\"),ROW(I4))),15),\"\")","v":""},{"$f":"IFERROR(INDEX(Table1[Start],SMALL(IF(Month!L$13=INT(Table1[Start]),MATCH(ROW(Table1[Start]),ROW(Table1[Start])),\"\"),ROW(K4))),\"\")","v":""},{"$f":"IFERROR(LEFT(INDEX(Table1[Events],SMALL(IF(Month!L$13=INT(Table1[Start]),MATCH(ROW(Table1[Start]),ROW(Table1[Start])),\"\"),ROW(K4))),15),\"\")","v":""},{"$f":"IFERROR(INDEX(Table1[Start],SMALL(IF(Month!N$13=INT(Table1[Start]),MATCH(ROW(Table1[Start]),ROW(Table1[Start])),\"\"),ROW(M4))),\"\")","v":""},{"$f":"IFERROR(LEFT(INDEX(Table1[Events],SMALL(IF(Month!N$13=INT(Table1[Start]),MATCH(ROW(Table1[Start]),ROW(Table1[Start])),\"\"),ROW(M4))),15),\"\")","v":""},null,{"$f":"IFERROR(INDEX(Table1[Start],SMALL(IF(INT(Table1[Start])=Month!$Q$6,MATCH(ROW(Table1[Start]),ROW(Table1[Start])),\"\"),ROW(A10))),\"\")","v":""},{"$f":"IFERROR(INDEX(Table1[Events],SMALL(IF(INT(Table1[Start])=Month!$Q$6,MATCH(ROW(Table1[Start]),ROW(Table1[Start])),\"\"),ROW(A10))),\"\")","v":""}]
[null,{"$f":"B13+7","v":"2013-02-10"},null,{"$f":"B18+1","v":"2013-02-11"},null,{"$f":"D18+1","v":"2013-02-12"},null,{"$f":"F18+1","v":"2013-02-13"},null,{"$f":"H18+1","v":"2013-02-14"},null,{"$f":"J18+1","v":"2013-02-15"},null,{"$f":"L18+1","v":"2013-02-16"},null,null,{"$f":"IFERROR(INDEX(Table1[Start],SMALL(IF(INT(Table1[Start])=Month!$Q$6,MATCH(ROW(Table1[Start]),ROW(Table1[Start])),\"\"),ROW(A11))),\"\")","v":""},{"$f":"IFERROR(INDEX(Table1[Events],SMALL(IF(INT(Table1[Start])=Month!$Q$6,MATCH(ROW(Table1[Start]),ROW(Table1[Start])),\"\"),ROW(A11))),\"\")","v":""}]
[null,{"$f":"IFERROR(INDEX(Table1[Start],SMALL(IF(Month!B$18=INT(Table1[Start]),MATCH(ROW(Table1[Start]),ROW(Table1[Start])),\"\"),ROW(A1))),\"\")","v":""},{"$f":"IFERROR(LEFT(INDEX(Table1[Events],SMALL(IF(Month!B$18=INT(Table1[Start]),MATCH(ROW(Table1[Start]),ROW(Table1[Start])),\"\"),ROW(A1))),15),\"\")","v":""},{"$f":"IFERROR(INDEX(Table1[Start],SMALL(IF(Month!D$18=INT(Table1[Start]),MATCH(ROW(Table1[Start]),ROW(Table1[Start])),\"\"),ROW(C1))),\"\")","v":""},{"$f":"IFERROR(LEFT(INDEX(Table1[Events],SMALL(IF(Month!D$18=INT(Table1[Start]),MATCH(ROW(Table1[Start]),ROW(Table1[Start])),\"\"),ROW(C1))),15),\"\")","v":""},{"$f":"IFERROR(INDEX(Table1[Start],SMALL(IF(Month!F$18=INT(Table1[Start]),MATCH(ROW(Table1[Start]),ROW(Table1[Start])),\"\"),ROW(E1))),\"\")","v":""},{"$f":"IFERROR(LEFT(INDEX(Table1[Events],SMALL(IF(Month!F$18=INT(Table1[Start]),MATCH(ROW(Table1[Start]),ROW(Table1[Start])),\"\"),ROW(E1))),15),\"\")","v":""},{"$f":"IFERROR(INDEX(Table1[Start],SMALL(IF(Month!H$18=INT(Table1[Start]),MATCH(ROW(Table1[Start]),ROW(Table1[Start])),\"\"),ROW(G1))),\"\")","v":""},{"$f":"IFERROR(LEFT(INDEX(Table1[Events],SMALL(IF(Month!H$18=INT(Table1[Start]),MATCH(ROW(Table1[Start]),ROW(Table1[Start])),\"\"),ROW(G1))),15),\"\")","v":""},{"$f":"IFERROR(INDEX(Table1[Start],SMALL(IF(Month!J$18=INT(Table1[Start]),MATCH(ROW(Table1[Start]),ROW(Table1[Start])),\"\"),ROW(I1))),\"\")","v":""},{"$f":"IFERROR(LEFT(INDEX(Table1[Events],SMALL(IF(Month!J$18=INT(Table1[Start]),MATCH(ROW(Table1[Start]),ROW(Table1[Start])),\"\"),ROW(I1))),15),\"\")","v":""},{"$f":"IFERROR(INDEX(Table1[Start],SMALL(IF(Month!L$18=INT(Table1[Start]),MATCH(ROW(Table1[Start]),ROW(Table1[Start])),\"\"),ROW(K1))),\"\")","v":""},{"$f":"IFERROR(LEFT(INDEX(Table1[Events],SMALL(IF(Month!L$18=INT(Table1[Start]),MATCH(ROW(Table1[Start]),ROW(Table1[Start])),\"\"),ROW(K1))),15),\"\")","v":""},{"$f":"IFERROR(INDEX(Table1[Start],SMALL(IF(Month!N$18=INT(Table1[Start]),MATCH(ROW(Table1[Start]),ROW(Table1[Start])),\"\"),ROW(M1))),\"\")","v":""},{"$f":"IFERROR(LEFT(INDEX(Table1[Events],SMALL(IF(Month!N$18=INT(Table1[Start]),MATCH(ROW(Table1[Start]),ROW(Table1[Start])),\"\"),ROW(M1))),15),\"\")","v":""},null,{"$f":"IFERROR(INDEX(Table1[Start],SMALL(IF(INT(Table1[Start])=Month!$Q$6,MATCH(ROW(Table1[Start]),ROW(Table1[Start])),\"\"),ROW(A12))),\"\")","v":""},{"$f":"IFERROR(INDEX(Table1[Events],SMALL(IF(INT(Table1[Start])=Month!$Q$6,MATCH(ROW(Table1[Start]),ROW(Table1[Start])),\"\"),ROW(A12))),\"\")","v":""}]
[null,{"$f":"IFERROR(INDEX(Table1[Start],SMALL(IF(Month!B$18=INT(Table1[Start]),MATCH(ROW(Table1[Start]),ROW(Table1[Start])),\"\"),ROW(A2))),\"\")","v":""},{"$f":"IFERROR(LEFT(INDEX(Table1[Events],SMALL(IF(Month!B$18=INT(Table1[Start]),MATCH(ROW(Table1[Start]),ROW(Table1[Start])),\"\"),ROW(A2))),15),\"\")","v":""},{"$f":"IFERROR(INDEX(Table1[Start],SMALL(IF(Month!D$18=INT(Table1[Start]),MATCH(ROW(Table1[Start]),ROW(Table1[Start])),\"\"),ROW(C2))),\"\")","v":""},{"$f":"IFERROR(LEFT(INDEX(Table1[Events],SMALL(IF(Month!D$18=INT(Table1[Start]),MATCH(ROW(Table1[Start]),ROW(Table1[Start])),\"\"),ROW(C2))),15),\"\")","v":""},{"$f":"IFERROR(INDEX(Table1[Start],SMALL(IF(Month!F$18=INT(Table1[Start]),MATCH(ROW(Table1[Start]),ROW(Table1[Start])),\"\"),ROW(E2))),\"\")","v":""},{"$f":"IFERROR(LEFT(INDEX(Table1[Events],SMALL(IF(Month!F$18=INT(Table1[Start]),MATCH(ROW(Table1[Start]),ROW(Table1[Start])),\"\"),ROW(E2))),15),\"\")","v":""},{"$f":"IFERROR(INDEX(Table1[Start],SMALL(IF(Month!H$18=INT(Table1[Start]),MATCH(ROW(Table1[Start]),ROW(Table1[Start])),\"\"),ROW(G2))),\"\")","v":""},{"$f":"IFERROR(LEFT(INDEX(Table1[Events],SMALL(IF(Month!H$18=INT(Table1[Start]),MATCH(ROW(Table1[Start]),ROW(Table1[Start])),\"\"),ROW(G2))),15),\"\")","v":""},{"$f":"IFERROR(INDEX(Table1[Start],SMALL(IF(Month!J$18=INT(Table1[Start]),MATCH(ROW(Table1[Start]),ROW(Table1[Start])),\"\"),ROW(I2))),\"\")","v":""},{"$f":"IFERROR(LEFT(INDEX(Table1[Events],SMALL(IF(Month!J$18=INT(Table1[Start]),MATCH(ROW(Table1[Start]),ROW(Table1[Start])),\"\"),ROW(I2))),15),\"\")","v":""},{"$f":"IFERROR(INDEX(Table1[Start],SMALL(IF(Month!L$18=INT(Table1[Start]),MATCH(ROW(Table1[Start]),ROW(Table1[Start])),\"\"),ROW(K2))),\"\")","v":""},{"$f":"IFERROR(LEFT(INDEX(Table1[Events],SMALL(IF(Month!L$18=INT(Table1[Start]),MATCH(ROW(Table1[Start]),ROW(Table1[Start])),\"\"),ROW(K2))),15),\"\")","v":""},{"$f":"IFERROR(INDEX(Table1[Start],SMALL(IF(Month!N$18=INT(Table1[Start]),MATCH(ROW(Table1[Start]),ROW(Table1[Start])),\"\"),ROW(M2))),\"\")","v":""},{"$f":"IFERROR(LEFT(INDEX(Table1[Events],SMALL(IF(Month!N$18=INT(Table1[Start]),MATCH(ROW(Table1[Start]),ROW(Table1[Start])),\"\"),ROW(M2))),15),\"\")","v":""},null,{"$f":"IFERROR(INDEX(Table1[Start],SMALL(IF(INT(Table1[Start])=Month!$Q$6,MATCH(ROW(Table1[Start]),ROW(Table1[Start])),\"\"),ROW(A13))),\"\")","v":""},{"$f":"IFERROR(INDEX(Table1[Events],SMALL(IF(INT(Table1[Start])=Month!$Q$6,MATCH(ROW(Table1[Start]),ROW(Table1[Start])),\"\"),ROW(A13))),\"\")","v":""}]
[null,{"$f":"IFERROR(INDEX(Table1[Start],SMALL(IF(Month!B$18=INT(Table1[Start]),MATCH(ROW(Table1[Start]),ROW(Table1[Start])),\"\"),ROW(A3))),\"\")","v":""},{"$f":"IFERROR(LEFT(INDEX(Table1[Events],SMALL(IF(Month!B$18=INT(Table1[Start]),MATCH(ROW(Table1[Start]),ROW(Table1[Start])),\"\"),ROW(A3))),15),\"\")","v":""},{"$f":"IFERROR(INDEX(Table1[Start],SMALL(IF(Month!D$18=INT(Table1[Start]),MATCH(ROW(Table1[Start]),ROW(Table1[Start])),\"\"),ROW(C3))),\"\")","v":""},{"$f":"IFERROR(LEFT(INDEX(Table1[Events],SMALL(IF(Month!D$18=INT(Table1[Start]),MATCH(ROW(Table1[Start]),ROW(Table1[Start])),\"\"),ROW(C3))),15),\"\")","v":""},{"$f":"IFERROR(INDEX(Table1[Start],SMALL(IF(Month!F$18=INT(Table1[Start]),MATCH(ROW(Table1[Start]),ROW(Table1[Start])),\"\"),ROW(E3))),\"\")","v":""},{"$f":"IFERROR(LEFT(INDEX(Table1[Events],SMALL(IF(Month!F$18=INT(Table1[Start]),MATCH(ROW(Table1[Start]),ROW(Table1[Start])),\"\"),ROW(E3))),15),\"\")","v":""},{"$f":"IFERROR(INDEX(Table1[Start],SMALL(IF(Month!H$18=INT(Table1[Start]),MATCH(ROW(Table1[Start]),ROW(Table1[Start])),\"\"),ROW(G3))),\"\")","v":""},{"$f":"IFERROR(LEFT(INDEX(Table1[Events],SMALL(IF(Month!H$18=INT(Table1[Start]),MATCH(ROW(Table1[Start]),ROW(Table1[Start])),\"\"),ROW(G3))),15),\"\")","v":""},{"$f":"IFERROR(INDEX(Table1[Start],SMALL(IF(Month!J$18=INT(Table1[Start]),MATCH(ROW(Table1[Start]),ROW(Table1[Start])),\"\"),ROW(I3))),\"\")","v":""},{"$f":"IFERROR(LEFT(INDEX(Table1[Events],SMALL(IF(Month!J$18=INT(Table1[Start]),MATCH(ROW(Table1[Start]),ROW(Table1[Start])),\"\"),ROW(I3))),15),\"\")","v":""},{"$f":"IFERROR(INDEX(Table1[Start],SMALL(IF(Month!L$18=INT(Table1[Start]),MATCH(ROW(Table1[Start]),ROW(Table1[Start])),\"\"),ROW(K3))),\"\")","v":""},{"$f":"IFERROR(LEFT(INDEX(Table1[Events],SMALL(IF(Month!L$18=INT(Table1[Start]),MATCH(ROW(Table1[Start]),ROW(Table1[Start])),\"\"),ROW(K3))),15),\"\")","v":""},{"$f":"IFERROR(INDEX(Table1[Start],SMALL(IF(Month!N$18=INT(Table1[Start]),MATCH(ROW(Table1[Start]),ROW(Table1[Start])),\"\"),ROW(M3))),\"\")","v":""},{"$f":"IFERROR(LEFT(INDEX(Table1[Events],SMALL(IF(Month!N$18=INT(Table1[Start]),MATCH(ROW(Table1[Start]),ROW(Table1[Start])),\"\"),ROW(M3))),15),\"\")","v":""},null,{"$f":"IFERROR(INDEX(Table1[Start],SMALL(IF(INT(Table1[Start])=Month!$Q$6,MATCH(ROW(Table1[Start]),ROW(Table1[Start])),\"\"),ROW(A14))),\"\")","v":""},{"$f":"IFERROR(INDEX(Table1[Events],SMALL(IF(INT(Table1[Start])=Month!$Q$6,MATCH(ROW(Table1[Start]),ROW(Table1[Start])),\"\"),ROW(A14))),\"\")","v":""}]
[null,{"$f":"IFERROR(INDEX(Table1[Start],SMALL(IF(Month!B$18=INT(Table1[Start]),MATCH(ROW(Table1[Start]),ROW(Table1[Start])),\"\"),ROW(A4))),\"\")","v":""},{"$f":"IFERROR(LEFT(INDEX(Table1[Events],SMALL(IF(Month!B$18=INT(Table1[Start]),MATCH(ROW(Table1[Start]),ROW(Table1[Start])),\"\"),ROW(A4))),15),\"\")","v":""},{"$f":"IFERROR(INDEX(Table1[Start],SMALL(IF(Month!D$18=INT(Table1[Start]),MATCH(ROW(Table1[Start]),ROW(Table1[Start])),\"\"),ROW(C4))),\"\")","v":""},{"$f":"IFERROR(LEFT(INDEX(Table1[Events],SMALL(IF(Month!D$18=INT(Table1[Start]),MATCH(ROW(Table1[Start]),ROW(Table1[Start])),\"\"),ROW(C4))),15),\"\")","v":""},{"$f":"IFERROR(INDEX(Table1[Start],SMALL(IF(Month!F$18=INT(Table1[Start]),MATCH(ROW(Table1[Start]),ROW(Table1[Start])),\"\"),ROW(E4))),\"\")","v":""},{"$f":"IFERROR(LEFT(INDEX(Table1[Events],SMALL(IF(Month!F$18=INT(Table1[Start]),MATCH(ROW(Table1[Start]),ROW(Table1[Start])),\"\"),ROW(E4))),15),\"\")","v":""},{"$f":"IFERROR(INDEX(Table1[Start],SMALL(IF(Month!H$18=INT(Table1[Start]),MATCH(ROW(Table1[Start]),ROW(Table1[Start])),\"\"),ROW(G4))),\"\")","v":""},{"$f":"IFERROR(LEFT(INDEX(Table1[Events],SMALL(IF(Month!H$18=INT(Table1[Start]),MATCH(ROW(Table1[Start]),ROW(Table1[Start])),\"\"),ROW(G4))),15),\"\")","v":""},{"$f":"IFERROR(INDEX(Table1[Start],SMALL(IF(Month!J$18=INT(Table1[Start]),MATCH(ROW(Table1[Start]),ROW(Table1[Start])),\"\"),ROW(I4))),\"\")","v":""},{"$f":"IFERROR(LEFT(INDEX(Table1[Events],SMALL(IF(Month!J$18=INT(Table1[Start]),MATCH(ROW(Table1[Start]),ROW(Table1[Start])),\"\"),ROW(I4))),15),\"\")","v":""},{"$f":"IFERROR(INDEX(Table1[Start],SMALL(IF(Month!L$18=INT(Table1[Start]),MATCH(ROW(Table1[Start]),ROW(Table1[Start])),\"\"),ROW(K4))),\"\")","v":""},{"$f":"IFERROR(LEFT(INDEX(Table1[Events],SMALL(IF(Month!L$18=INT(Table1[Start]),MATCH(ROW(Table1[Start]),ROW(Table1[Start])),\"\"),ROW(K4))),15),\"\")","v":""},{"$f":"IFERROR(INDEX(Table1[Start],SMALL(IF(Month!N$18=INT(Table1[Start]),MATCH(ROW(Table1[Start]),ROW(Table1[Start])),\"\"),ROW(M4))),\"\")","v":""},{"$f":"IFERROR(LEFT(INDEX(Table1[Events],SMALL(IF(Month!N$18=INT(Table1[Start]),MATCH(ROW(Table1[Start]),ROW(Table1[Start])),\"\"),ROW(M4))),15),\"\")","v":""},null,{"$f":"IFERROR(INDEX(Table1[Start],SMALL(IF(INT(Table1[Start])=Month!$Q$6,MATCH(ROW(Table1[Start]),ROW(Table1[Start])),\"\"),ROW(A15))),\"\")","v":""},{"$f":"IFERROR(INDEX(Table1[Events],SMALL(IF(INT(Table1[Start])=Month!$Q$6,MATCH(ROW(Table1[Start]),ROW(Table1[Start])),\"\"),ROW(A15))),\"\")","v":""}]
[null,{"$f":"B18+7","v":"2013-02-17"},null,{"$f":"B23+1","v":"2013-02-18"},null,{"$f":"D23+1","v":"2013-02-19"},null,{"$f":"F23+1","v":"2013-02-20"},null,{"$f":"H23+1","v":"2013-02-21"},null,{"$f":"J23+1","v":"2013-02-22"},null,{"$f":"L23+1","v":"2013-02-23"},null,null,{"$f":"IFERROR(INDEX(Table1[Start],SMALL(IF(INT(Table1[Start])=Month!$Q$6,MATCH(ROW(Table1[Start]),ROW(Table1[Start])),\"\"),ROW(A16))),\"\")","v":""},{"$f":"IFERROR(INDEX(Table1[Events],SMALL(IF(INT(Table1[Start])=Month!$Q$6,MATCH(ROW(Table1[Start]),ROW(Table1[Start])),\"\"),ROW(A16))),\"\")","v":""}]
[null,{"$f":"IFERROR(INDEX(Table1[Start],SMALL(IF(Month!B$23=INT(Table1[Start]),MATCH(ROW(Table1[Start]),ROW(Table1[Start])),\"\"),ROW(A1))),\"\")","v":""},{"$f":"IFERROR(LEFT(INDEX(Table1[Events],SMALL(IF(Month!B$23=INT(Table1[Start]),MATCH(ROW(Table1[Start]),ROW(Table1[Start])),\"\"),ROW(A1))),15),\"\")","v":""},{"$f":"IFERROR(INDEX(Table1[Start],SMALL(IF(Month!D$23=INT(Table1[Start]),MATCH(ROW(Table1[Start]),ROW(Table1[Start])),\"\"),ROW(C1))),\"\")","v":""},{"$f":"IFERROR(LEFT(INDEX(Table1[Events],SMALL(IF(Month!D$23=INT(Table1[Start]),MATCH(ROW(Table1[Start]),ROW(Table1[Start])),\"\"),ROW(C1))),15),\"\")","v":""},{"$f":"IFERROR(INDEX(Table1[Start],SMALL(IF(Month!F$23=INT(Table1[Start]),MATCH(ROW(Table1[Start]),ROW(Table1[Start])),\"\"),ROW(E1))),\"\")","v":""},{"$f":"IFERROR(LEFT(INDEX(Table1[Events],SMALL(IF(Month!F$23=INT(Table1[Start]),MATCH(ROW(Table1[Start]),ROW(Table1[Start])),\"\"),ROW(E1))),15),\"\")","v":""},{"$f":"IFERROR(INDEX(Table1[Start],SMALL(IF(Month!H$23=INT(Table1[Start]),MATCH(ROW(Table1[Start]),ROW(Table1[Start])),\"\"),ROW(G1))),\"\")","v":""},{"$f":"IFERROR(LEFT(INDEX(Table1[Events],SMALL(IF(Month!H$23=INT(Table1[Start]),MATCH(ROW(Table1[Start]),ROW(Table1[Start])),\"\"),ROW(G1))),15),\"\")","v":""},{"$f":"IFERROR(INDEX(Table1[Start],SMALL(IF(Month!J$23=INT(Table1[Start]),MATCH(ROW(Table1[Start]),ROW(Table1[Start])),\"\"),ROW(I1))),\"\")","v":""},{"$f":"IFERROR(LEFT(INDEX(Table1[Events],SMALL(IF(Month!J$23=INT(Table1[Start]),MATCH(ROW(Table1[Start]),ROW(Table1[Start])),\"\"),ROW(I1))),15),\"\")","v":""},{"$f":"IFERROR(INDEX(Table1[Start],SMALL(IF(Month!L$23=INT(Table1[Start]),MATCH(ROW(Table1[Start]),ROW(Table1[Start])),\"\"),ROW(K1))),\"\")","v":""},{"$f":"IFERROR(LEFT(INDEX(Table1[Events],SMALL(IF(Month!L$23=INT(Table1[Start]),MATCH(ROW(Table1[Start]),ROW(Table1[Start])),\"\"),ROW(K1))),15),\"\")","v":""},{"$f":"IFERROR(INDEX(Table1[Start],SMALL(IF(Month!N$23=INT(Table1[Start]),MATCH(ROW(Table1[Start]),ROW(Table1[Start])),\"\"),ROW(M1))),\"\")","v":""},{"$f":"IFERROR(LEFT(INDEX(Table1[Events],SMALL(IF(Month!N$23=INT(Table1[Start]),MATCH(ROW(Table1[Start]),ROW(Table1[Start])),\"\"),ROW(M1))),15),\"\")","v":""},null,{"$f":"IFERROR(INDEX(Table1[Start],SMALL(IF(INT(Table1[Start])=Month!$Q$6,MATCH(ROW(Table1[Start]),ROW(Table1[Start])),\"\"),ROW(A17))),\"\")","v":""},{"$f":"IFERROR(INDEX(Table1[Events],SMALL(IF(INT(Table1[Start])=Month!$Q$6,MATCH(ROW(Table1[Start]),ROW(Table1[Start])),\"\"),ROW(A17))),\"\")","v":""}]
[null,{"$f":"IFERROR(INDEX(Table1[Start],SMALL(IF(Month!B$23=INT(Table1[Start]),MATCH(ROW(Table1[Start]),ROW(Table1[Start])),\"\"),ROW(A2))),\"\")","v":""},{"$f":"IFERROR(LEFT(INDEX(Table1[Events],SMALL(IF(Month!B$23=INT(Table1[Start]),MATCH(ROW(Table1[Start]),ROW(Table1[Start])),\"\"),ROW(A2))),15),\"\")","v":""},{"$f":"IFERROR(INDEX(Table1[Start],SMALL(IF(Month!D$23=INT(Table1[Start]),MATCH(ROW(Table1[Start]),ROW(Table1[Start])),\"\"),ROW(C2))),\"\")","v":""},{"$f":"IFERROR(LEFT(INDEX(Table1[Events],SMALL(IF(Month!D$23=INT(Table1[Start]),MATCH(ROW(Table1[Start]),ROW(Table1[Start])),\"\"),ROW(C2))),15),\"\")","v":""},{"$f":"IFERROR(INDEX(Table1[Start],SMALL(IF(Month!F$23=INT(Table1[Start]),MATCH(ROW(Table1[Start]),ROW(Table1[Start])),\"\"),ROW(E2))),\"\")","v":""},{"$f":"IFERROR(LEFT(INDEX(Table1[Events],SMALL(IF(Month!F$23=INT(Table1[Start]),MATCH(ROW(Table1[Start]),ROW(Table1[Start])),\"\"),ROW(E2))),15),\"\")","v":""},{"$f":"IFERROR(INDEX(Table1[Start],SMALL(IF(Month!H$23=INT(Table1[Start]),MATCH(ROW(Table1[Start]),ROW(Table1[Start])),\"\"),ROW(G2))),\"\")","v":""},{"$f":"IFERROR(LEFT(INDEX(Table1[Events],SMALL(IF(Month!H$23=INT(Table1[Start]),MATCH(ROW(Table1[Start]),ROW(Table1[Start])),\"\"),ROW(G2))),15),\"\")","v":""},{"$f":"IFERROR(INDEX(Table1[Start],SMALL(IF(Month!J$23=INT(Table1[Start]),MATCH(ROW(Table1[Start]),ROW(Table1[Start])),\"\"),ROW(I2))),\"\")","v":""},{"$f":"IFERROR(LEFT(INDEX(Table1[Events],SMALL(IF(Month!J$23=INT(Table1[Start]),MATCH(ROW(Table1[Start]),ROW(Table1[Start])),\"\"),ROW(I2))),15),\"\")","v":""},{"$f":"IFERROR(INDEX(Table1[Start],SMALL(IF(Month!L$23=INT(Table1[Start]),MATCH(ROW(Table1[Start]),ROW(Table1[Start])),\"\"),ROW(K2))),\"\")","v":""},{"$f":"IFERROR(LEFT(INDEX(Table1[Events],SMALL(IF(Month!L$23=INT(Table1[Start]),MATCH(ROW(Table1[Start]),ROW(Table1[Start])),\"\"),ROW(K2))),15),\"\")","v":""},{"$f":"IFERROR(INDEX(Table1[Start],SMALL(IF(Month!N$23=INT(Table1[Start]),MATCH(ROW(Table1[Start]),ROW(Table1[Start])),\"\"),ROW(M2))),\"\")","v":""},{"$f":"IFERROR(LEFT(INDEX(Table1[Events],SMALL(IF(Month!N$23=INT(Table1[Start]),MATCH(ROW(Table1[Start]),ROW(Table1[Start])),\"\"),ROW(M2))),15),\"\")","v":""},null,{"$f":"IFERROR(INDEX(Table1[Start],SMALL(IF(INT(Table1[Start])=Month!$Q$6,MATCH(ROW(Table1[Start]),ROW(Table1[Start])),\"\"),ROW(A18))),\"\")","v":""},{"$f":"IFERROR(INDEX(Table1[Events],SMALL(IF(INT(Table1[Start])=Month!$Q$6,MATCH(ROW(Table1[Start]),ROW(Table1[Start])),\"\"),ROW(A18))),\"\")","v":""}]
[null,{"$f":"IFERROR(INDEX(Table1[Start],SMALL(IF(Month!B$23=INT(Table1[Start]),MATCH(ROW(Table1[Start]),ROW(Table1[Start])),\"\"),ROW(A3))),\"\")","v":""},{"$f":"IFERROR(LEFT(INDEX(Table1[Events],SMALL(IF(Month!B$23=INT(Table1[Start]),MATCH(ROW(Table1[Start]),ROW(Table1[Start])),\"\"),ROW(A3))),15),\"\")","v":""},{"$f":"IFERROR(INDEX(Table1[Start],SMALL(IF(Month!D$23=INT(Table1[Start]),MATCH(ROW(Table1[Start]),ROW(Table1[Start])),\"\"),ROW(C3))),\"\")","v":""},{"$f":"IFERROR(LEFT(INDEX(Table1[Events],SMALL(IF(Month!D$23=INT(Table1[Start]),MATCH(ROW(Table1[Start]),ROW(Table1[Start])),\"\"),ROW(C3))),15),\"\")","v":""},{"$f":"IFERROR(INDEX(Table1[Start],SMALL(IF(Month!F$23=INT(Table1[Start]),MATCH(ROW(Table1[Start]),ROW(Table1[Start])),\"\"),ROW(E3))),\"\")","v":""},{"$f":"IFERROR(LEFT(INDEX(Table1[Events],SMALL(IF(Month!F$23=INT(Table1[Start]),MATCH(ROW(Table1[Start]),ROW(Table1[Start])),\"\"),ROW(E3))),15),\"\")","v":""},{"$f":"IFERROR(INDEX(Table1[Start],SMALL(IF(Month!H$23=INT(Table1[Start]),MATCH(ROW(Table1[Start]),ROW(Table1[Start])),\"\"),ROW(G3))),\"\")","v":""},{"$f":"IFERROR(LEFT(INDEX(Table1[Events],SMALL(IF(Month!H$23=INT(Table1[Start]),MATCH(ROW(Table1[Start]),ROW(Table1[Start])),\"\"),ROW(G3))),15),\"\")","v":""},{"$f":"IFERROR(INDEX(Table1[Start],SMALL(IF(Month!J$23=INT(Table1[Start]),MATCH(ROW(Table1[Start]),ROW(Table1[Start])),\"\"),ROW(I3))),\"\")","v":""},{"$f":"IFERROR(LEFT(INDEX(Table1[Events],SMALL(IF(Month!J$23=INT(Table1[Start]),MATCH(ROW(Table1[Start]),ROW(Table1[Start])),\"\"),ROW(I3))),15),\"\")","v":""},{"$f":"IFERROR(INDEX(Table1[Start],SMALL(IF(Month!L$23=INT(Table1[Start]),MATCH(ROW(Table1[Start]),ROW(Table1[Start])),\"\"),ROW(K3))),\"\")","v":""},{"$f":"IFERROR(LEFT(INDEX(Table1[Events],SMALL(IF(Month!L$23=INT(Table1[Start]),MATCH(ROW(Table1[Start]),ROW(Table1[Start])),\"\"),ROW(K3))),15),\"\")","v":""},{"$f":"IFERROR(INDEX(Table1[Start],SMALL(IF(Month!N$23=INT(Table1[Start]),MATCH(ROW(Table1[Start]),ROW(Table1[Start])),\"\"),ROW(M3))),\"\")","v":""},{"$f":"IFERROR(LEFT(INDEX(Table1[Events],SMALL(IF(Month!N$23=INT(Table1[Start]),MATCH(ROW(Table1[Start]),ROW(Table1[Start])),\"\"),ROW(M3))),15),\"\")","v":""},null,{"$f":"IFERROR(INDEX(Table1[Start],SMALL(IF(INT(Table1[Start])=Month!$Q$6,MATCH(ROW(Table1[Start]),ROW(Table1[Start])),\"\"),ROW(A19))),\"\")","v":""},{"$f":"IFERROR(INDEX(Table1[Events],SMALL(IF(INT(Table1[Start])=Month!$Q$6,MATCH(ROW(Table1[Start]),ROW(Table1[Start])),\"\"),ROW(A19))),\"\")","v":""}]
[null,{"$f":"IFERROR(INDEX(Table1[Start],SMALL(IF(Month!B$23=INT(Table1[Start]),MATCH(ROW(Table1[Start]),ROW(Table1[Start])),\"\"),ROW(A4))),\"\")","v":""},{"$f":"IFERROR(LEFT(INDEX(Table1[Events],SMALL(IF(Month!B$23=INT(Table1[Start]),MATCH(ROW(Table1[Start]),ROW(Table1[Start])),\"\"),ROW(A4))),15),\"\")","v":""},{"$f":"IFERROR(INDEX(Table1[Start],SMALL(IF(Month!D$23=INT(Table1[Start]),MATCH(ROW(Table1[Start]),ROW(Table1[Start])),\"\"),ROW(C4))),\"\")","v":""},{"$f":"IFERROR(LEFT(INDEX(Table1[Events],SMALL(IF(Month!D$23=INT(Table1[Start]),MATCH(ROW(Table1[Start]),ROW(Table1[Start])),\"\"),ROW(C4))),15),\"\")","v":""},{"$f":"IFERROR(INDEX(Table1[Start],SMALL(IF(Month!F$23=INT(Table1[Start]),MATCH(ROW(Table1[Start]),ROW(Table1[Start])),\"\"),ROW(E4))),\"\")","v":""},{"$f":"IFERROR(LEFT(INDEX(Table1[Events],SMALL(IF(Month!F$23=INT(Table1[Start]),MATCH(ROW(Table1[Start]),ROW(Table1[Start])),\"\"),ROW(E4))),15),\"\")","v":""},{"$f":"IFERROR(INDEX(Table1[Start],SMALL(IF(Month!H$23=INT(Table1[Start]),MATCH(ROW(Table1[Start]),ROW(Table1[Start])),\"\"),ROW(G4))),\"\")","v":""},{"$f":"IFERROR(LEFT(INDEX(Table1[Events],SMALL(IF(Month!H$23=INT(Table1[Start]),MATCH(ROW(Table1[Start]),ROW(Table1[Start])),\"\"),ROW(G4))),15),\"\")","v":""},{"$f":"IFERROR(INDEX(Table1[Start],SMALL(IF(Month!J$23=INT(Table1[Start]),MATCH(ROW(Table1[Start]),ROW(Table1[Start])),\"\"),ROW(I4))),\"\")","v":""},{"$f":"IFERROR(LEFT(INDEX(Table1[Events],SMALL(IF(Month!J$23=INT(Table1[Start]),MATCH(ROW(Table1[Start]),ROW(Table1[Start])),\"\"),ROW(I4))),15),\"\")","v":""},{"$f":"IFERROR(INDEX(Table1[Start],SMALL(IF(Month!L$23=INT(Table1[Start]),MATCH(ROW(Table1[Start]),ROW(Table1[Start])),\"\"),ROW(K4))),\"\")","v":""},{"$f":"IFERROR(LEFT(INDEX(Table1[Events],SMALL(IF(Month!L$23=INT(Table1[Start]),MATCH(ROW(Table1[Start]),ROW(Table1[Start])),\"\"),ROW(K4))),15),\"\")","v":""},{"$f":"IFERROR(INDEX(Table1[Start],SMALL(IF(Month!N$23=INT(Table1[Start]),MATCH(ROW(Table1[Start]),ROW(Table1[Start])),\"\"),ROW(M4))),\"\")","v":""},{"$f":"IFERROR(LEFT(INDEX(Table1[Events],SMALL(IF(Month!N$23=INT(Table1[Start]),MATCH(ROW(Table1[Start]),ROW(Table1[Start])),\"\"),ROW(M4))),15),\"\")","v":""},null,{"$f":"IFERROR(INDEX(Table1[Start],SMALL(IF(INT(Table1[Start])=Month!$Q$6,MATCH(ROW(Table1[Start]),ROW(Table1[Start])),\"\"),ROW(A20))),\"\")","v":""},{"$f":"IFERROR(INDEX(Table1[Events],SMALL(IF(INT(Table1[Start])=Month!$Q$6,MATCH(ROW(Table1[Start]),ROW(Table1[Start])),\"\"),ROW(A20))),\"\")","v":""}]
[null,{"$f":"B23+7","v":"2013-02-24"},null,{"$f":"B28+1","v":"2013-02-25"},null,{"$f":"D28+1","v":"2013-02-26"},null,{"$f":"F28+1","v":"2013-02-27"},null,{"$f":"H28+1","v":"2013-02-28"},null,{"$f":"J28+1","v":"2013-03-01"},null,{"$f":"L28+1","v":"2013-03-02"},null,null,{"$f":"IFERROR(INDEX(Table1[Start],SMALL(IF(INT(Table1[Start])=Month!$Q$6,MATCH(ROW(Table1[Start]),ROW(Table1[Start])),\"\"),ROW(A21))),\"\")","v":""},{"$f":"IFERROR(INDEX(Table1[Events],SMALL(IF(INT(Table1[Start])=Month!$Q$6,MATCH(ROW(Table1[Start]),ROW(Table1[Start])),\"\"),ROW(A21))),\"\")","v":""}]
[null,{"$f":"IFERROR(INDEX(Table1[Start],SMALL(IF(Month!B$28=INT(Table1[Start]),MATCH(ROW(Table1[Start]),ROW(Table1[Start])),\"\"),ROW(A1))),\"\")","v":""},{"$f":"IFERROR(LEFT(INDEX(Table1[Events],SMALL(IF(Month!B$28=INT(Table1[Start]),MATCH(ROW(Table1[Start]),ROW(Table1[Start])),\"\"),ROW(A1))),15),\"\")","v":""},{"$f":"IFERROR(INDEX(Table1[Start],SMALL(IF(Month!D$28=INT(Table1[Start]),MATCH(ROW(Table1[Start]),ROW(Table1[Start])),\"\"),ROW(C1))),\"\")","v":41330.333333333336},{"$f":"IFERROR(LEFT(INDEX(Table1[Events],SMALL(IF(Month!D$28=INT(Table1[Start]),MATCH(ROW(Table1[Start]),ROW(Table1[Start])),\"\"),ROW(C1))),15),\"\")","v":"Event 2"},{"$f":"IFERROR(INDEX(Table1[Start],SMALL(IF(Month!F$28=INT(Table1[Start]),MATCH(ROW(Table1[Start]),ROW(Table1[Start])),\"\"),ROW(E1))),\"\")","v":""},{"$f":"IFERROR(LEFT(INDEX(Table1[Events],SMALL(IF(Month!F$28=INT(Table1[Start]),MATCH(ROW(Table1[Start]),ROW(Table1[Start])),\"\"),ROW(E1))),15),\"\")","v":""},{"$f":"IFERROR(INDEX(Table1[Start],SMALL(IF(Month!H$28=INT(Table1[Start]),MATCH(ROW(Table1[Start]),ROW(Table1[Start])),\"\"),ROW(G1))),\"\")","v":""},{"$f":"IFERROR(LEFT(INDEX(Table1[Events],SMALL(IF(Month!H$28=INT(Table1[Start]),MATCH(ROW(Table1[Start]),ROW(Table1[Start])),\"\"),ROW(G1))),15),\"\")","v":""},{"$f":"IFERROR(INDEX(Table1[Start],SMALL(IF(Month!J$28=INT(Table1[Start]),MATCH(ROW(Table1[Start]),ROW(Table1[Start])),\"\"),ROW(I1))),\"\")","v":""},{"$f":"IFERROR(LEFT(INDEX(Table1[Events],SMALL(IF(Month!J$28=INT(Table1[Start]),MATCH(ROW(Table1[Start]),ROW(Table1[Start])),\"\"),ROW(I1))),15),\"\")","v":""},{"$f":"IFERROR(INDEX(Table1[Start],SMALL(IF(Month!L$28=INT(Table1[Start]),MATCH(ROW(Table1[Start]),ROW(Table1[Start])),\"\"),ROW(K1))),\"\")","v":""},{"$f":"IFERROR(LEFT(INDEX(Table1[Events],SMALL(IF(Month!L$28=INT(Table1[Start]),MATCH(ROW(Table1[Start]),ROW(Table1[Start])),\"\"),ROW(K1))),15),\"\")","v":""},{"$f":"IFERROR(INDEX(Table1[Start],SMALL(IF(Month!N$28=INT(Table1[Start]),MATCH(ROW(Table1[Start]),ROW(Table1[Start])),\"\"),ROW(M1))),\"\")","v":""},{"$f":"IFERROR(LEFT(INDEX(Table1[Events],SMALL(IF(Month!N$28=INT(Table1[Start]),MATCH(ROW(Table1[Start]),ROW(Table1[Start])),\"\"),ROW(M1))),15),\"\")","v":""},null,{"$f":"IFERROR(INDEX(Table1[Start],SMALL(IF(INT(Table1[Start])=Month!$Q$6,MATCH(ROW(Table1[Start]),ROW(Table1[Start])),\"\"),ROW(A22))),\"\")","v":""},{"$f":"IFERROR(INDEX(Table1[Events],SMALL(IF(INT(Table1[Start])=Month!$Q$6,MATCH(ROW(Table1[Start]),ROW(Table1[Start])),\"\"),ROW(A22))),\"\")","v":""}]
[null,{"$f":"IFERROR(INDEX(Table1[Start],SMALL(IF(Month!B$28=INT(Table1[Start]),MATCH(ROW(Table1[Start]),ROW(Table1[Start])),\"\"),ROW(A2))),\"\")","v":""},{"$f":"IFERROR(LEFT(INDEX(Table1[Events],SMALL(IF(Month!B$28=INT(Table1[Start]),MATCH(ROW(Table1[Start]),ROW(Table1[Start])),\"\"),ROW(A2))),15),\"\")","v":""},{"$f":"IFERROR(INDEX(Table1[Start],SMALL(IF(Month!D$28=INT(Table1[Start]),MATCH(ROW(Table1[Start]),ROW(Table1[Start])),\"\"),ROW(C2))),\"\")","v":""},{"$f":"IFERROR(LEFT(INDEX(Table1[Events],SMALL(IF(Month!D$28=INT(Table1[Start]),MATCH(ROW(Table1[Start]),ROW(Table1[Start])),\"\"),ROW(C2))),15),\"\")","v":""},{"$f":"IFERROR(INDEX(Table1[Start],SMALL(IF(Month!F$28=INT(Table1[Start]),MATCH(ROW(Table1[Start]),ROW(Table1[Start])),\"\"),ROW(E2))),\"\")","v":""},{"$f":"IFERROR(LEFT(INDEX(Table1[Events],SMALL(IF(Month!F$28=INT(Table1[Start]),MATCH(ROW(Table1[Start]),ROW(Table1[Start])),\"\"),ROW(E2))),15),\"\")","v":""},{"$f":"IFERROR(INDEX(Table1[Start],SMALL(IF(Month!H$28=INT(Table1[Start]),MATCH(ROW(Table1[Start]),ROW(Table1[Start])),\"\"),ROW(G2))),\"\")","v":""},{"$f":"IFERROR(LEFT(INDEX(Table1[Events],SMALL(IF(Month!H$28=INT(Table1[Start]),MATCH(ROW(Table1[Start]),ROW(Table1[Start])),\"\"),ROW(G2))),15),\"\")","v":""},{"$f":"IFERROR(INDEX(Table1[Start],SMALL(IF(Month!J$28=INT(Table1[Start]),MATCH(ROW(Table1[Start]),ROW(Table1[Start])),\"\"),ROW(I2))),\"\")","v":""},{"$f":"IFERROR(LEFT(INDEX(Table1[Events],SMALL(IF(Month!J$28=INT(Table1[Start]),MATCH(ROW(Table1[Start]),ROW(Table1[Start])),\"\"),ROW(I2))),15),\"\")","v":""},{"$f":"IFERROR(INDEX(Table1[Start],SMALL(IF(Month!L$28=INT(Table1[Start]),MATCH(ROW(Table1[Start]),ROW(Table1[Start])),\"\"),ROW(K2))),\"\")","v":""},{"$f":"IFERROR(LEFT(INDEX(Table1[Events],SMALL(IF(Month!L$28=INT(Table1[Start]),MATCH(ROW(Table1[Start]),ROW(Table1[Start])),\"\"),ROW(K2))),15),\"\")","v":""},{"$f":"IFERROR(INDEX(Table1[Start],SMALL(IF(Month!N$28=INT(Table1[Start]),MATCH(ROW(Table1[Start]),ROW(Table1[Start])),\"\"),ROW(M2))),\"\")","v":""},{"$f":"IFERROR(LEFT(INDEX(Table1[Events],SMALL(IF(Month!N$28=INT(Table1[Start]),MATCH(ROW(Table1[Start]),ROW(Table1[Start])),\"\"),ROW(M2))),15),\"\")","v":""},null,{"$f":"IFERROR(INDEX(Table1[Start],SMALL(IF(INT(Table1[Start])=Month!$Q$6,MATCH(ROW(Table1[Start]),ROW(Table1[Start])),\"\"),ROW(A23))),\"\")","v":""},{"$f":"IFERROR(INDEX(Table1[Events],SMALL(IF(INT(Table1[Start])=Month!$Q$6,MATCH(ROW(Table1[Start]),ROW(Table1[Start])),\"\"),ROW(A23))),\"\")","v":""}]
[null,{"$f":"IFERROR(INDEX(Table1[Start],SMALL(IF(Month!B$28=INT(Table1[Start]),MATCH(ROW(Table1[Start]),ROW(Table1[Start])),\"\"),ROW(A3))),\"\")","v":""},{"$f":"IFERROR(LEFT(INDEX(Table1[Events],SMALL(IF(Month!B$28=INT(Table1[Start]),MATCH(ROW(Table1[Start]),ROW(Table1[Start])),\"\"),ROW(A3))),15),\"\")","v":""},{"$f":"IFERROR(INDEX(Table1[Start],SMALL(IF(Month!D$28=INT(Table1[Start]),MATCH(ROW(Table1[Start]),ROW(Table1[Start])),\"\"),ROW(C3))),\"\")","v":""},{"$f":"IFERROR(LEFT(INDEX(Table1[Events],SMALL(IF(Month!D$28=INT(Table1[Start]),MATCH(ROW(Table1[Start]),ROW(Table1[Start])),\"\"),ROW(C3))),15),\"\")","v":""},{"$f":"IFERROR(INDEX(Table1[Start],SMALL(IF(Month!F$28=INT(Table1[Start]),MATCH(ROW(Table1[Start]),ROW(Table1[Start])),\"\"),ROW(E3))),\"\")","v":""},{"$f":"IFERROR(LEFT(INDEX(Table1[Events],SMALL(IF(Month!F$28=INT(Table1[Start]),MATCH(ROW(Table1[Start]),ROW(Table1[Start])),\"\"),ROW(E3))),15),\"\")","v":""},{"$f":"IFERROR(INDEX(Table1[Start],SMALL(IF(Month!H$28=INT(Table1[Start]),MATCH(ROW(Table1[Start]),ROW(Table1[Start])),\"\"),ROW(G3))),\"\")","v":""},{"$f":"IFERROR(LEFT(INDEX(Table1[Events],SMALL(IF(Month!H$28=INT(Table1[Start]),MATCH(ROW(Table1[Start]),ROW(Table1[Start])),\"\"),ROW(G3))),15),\"\")","v":""},{"$f":"IFERROR(INDEX(Table1[Start],SMALL(IF(Month!J$28=INT(Table1[Start]),MATCH(ROW(Table1[Start]),ROW(Table1[Start])),\"\"),ROW(I3))),\"\")","v":""},{"$f":"IFERROR(LEFT(INDEX(Table1[Events],SMALL(IF(Month!J$28=INT(Table1[Start]),MATCH(ROW(Table1[Start]),ROW(Table1[Start])),\"\"),ROW(I3))),15),\"\")","v":""},{"$f":"IFERROR(INDEX(Table1[Start],SMALL(IF(Month!L$28=INT(Table1[Start]),MATCH(ROW(Table1[Start]),ROW(Table1[Start])),\"\"),ROW(K3))),\"\")","v":""},{"$f":"IFERROR(LEFT(INDEX(Table1[Events],SMALL(IF(Month!L$28=INT(Table1[Start]),MATCH(ROW(Table1[Start]),ROW(Table1[Start])),\"\"),ROW(K3))),15),\"\")","v":""},{"$f":"IFERROR(INDEX(Table1[Start],SMALL(IF(Month!N$28=INT(Table1[Start]),MATCH(ROW(Table1[Start]),ROW(Table1[Start])),\"\"),ROW(M3))),\"\")","v":""},{"$f":"IFERROR(LEFT(INDEX(Table1[Events],SMALL(IF(Month!N$28=INT(Table1[Start]),MATCH(ROW(Table1[Start]),ROW(Table1[Start])),\"\"),ROW(M3))),15),\"\")","v":""},null,{"$f":"IFERROR(INDEX(Table1[Start],SMALL(IF(INT(Table1[Start])=Month!$Q$6,MATCH(ROW(Table1[Start]),ROW(Table1[Start])),\"\"),ROW(A24))),\"\")","v":""},{"$f":"IFERROR(INDEX(Table1[Events],SMALL(IF(INT(Table1[Start])=Month!$Q$6,MATCH(ROW(Table1[Start]),ROW(Table1[Start])),\"\"),ROW(A24))),\"\")","v":""}]
[null,{"$f":"IFERROR(INDEX(Table1[Start],SMALL(IF(Month!B$28=INT(Table1[Start]),MATCH(ROW(Table1[Start]),ROW(Table1[Start])),\"\"),ROW(A4))),\"\")","v":""},{"$f":"IFERROR(LEFT(INDEX(Table1[Events],SMALL(IF(Month!B$28=INT(Table1[Start]),MATCH(ROW(Table1[Start]),ROW(Table1[Start])),\"\"),ROW(A4))),15),\"\")","v":""},{"$f":"IFERROR(INDEX(Table1[Start],SMALL(IF(Month!D$28=INT(Table1[Start]),MATCH(ROW(Table1[Start]),ROW(Table1[Start])),\"\"),ROW(C4))),\"\")","v":""},{"$f":"IFERROR(LEFT(INDEX(Table1[Events],SMALL(IF(Month!D$28=INT(Table1[Start]),MATCH(ROW(Table1[Start]),ROW(Table1[Start])),\"\"),ROW(C4))),15),\"\")","v":""},{"$f":"IFERROR(INDEX(Table1[Start],SMALL(IF(Month!F$28=INT(Table1[Start]),MATCH(ROW(Table1[Start]),ROW(Table1[Start])),\"\"),ROW(E4))),\"\")","v":""},{"$f":"IFERROR(LEFT(INDEX(Table1[Events],SMALL(IF(Month!F$28=INT(Table1[Start]),MATCH(ROW(Table1[Start]),ROW(Table1[Start])),\"\"),ROW(E4))),15),\"\")","v":""},{"$f":"IFERROR(INDEX(Table1[Start],SMALL(IF(Month!H$28=INT(Table1[Start]),MATCH(ROW(Table1[Start]),ROW(Table1[Start])),\"\"),ROW(G4))),\"\")","v":""},{"$f":"IFERROR(LEFT(INDEX(Table1[Events],SMALL(IF(Month!H$28=INT(Table1[Start]),MATCH(ROW(Table1[Start]),ROW(Table1[Start])),\"\"),ROW(G4))),15),\"\")","v":""},{"$f":"IFERROR(INDEX(Table1[Start],SMALL(IF(Month!J$28=INT(Table1[Start]),MATCH(ROW(Table1[Start]),ROW(Table1[Start])),\"\"),ROW(I4))),\"\")","v":""},{"$f":"IFERROR(LEFT(INDEX(Table1[Events],SMALL(IF(Month!J$28=INT(Table1[Start]),MATCH(ROW(Table1[Start]),ROW(Table1[Start])),\"\"),ROW(I4))),15),\"\")","v":""},{"$f":"IFERROR(INDEX(Table1[Start],SMALL(IF(Month!L$28=INT(Table1[Start]),MATCH(ROW(Table1[Start]),ROW(Table1[Start])),\"\"),ROW(K4))),\"\")","v":""},{"$f":"IFERROR(LEFT(INDEX(Table1[Events],SMALL(IF(Month!L$28=INT(Table1[Start]),MATCH(ROW(Table1[Start]),ROW(Table1[Start])),\"\"),ROW(K4))),15),\"\")","v":""},{"$f":"IFERROR(INDEX(Table1[Start],SMALL(IF(Month!N$28=INT(Table1[Start]),MATCH(ROW(Table1[Start]),ROW(Table1[Start])),\"\"),ROW(M4))),\"\")","v":""},{"$f":"IFERROR(LEFT(INDEX(Table1[Events],SMALL(IF(Month!N$28=INT(Table1[Start]),MATCH(ROW(Table1[Start]),ROW(Table1[Start])),\"\"),ROW(M4))),15),\"\")","v":""},null,{"$f":"IFERROR(INDEX(Table1[Start],SMALL(IF(INT(Table1[Start])=Month!$Q$6,MATCH(ROW(Table1[Start]),ROW(Table1[Start])),\"\"),ROW(A25))),\"\")","v":""},{"$f":"IFERROR(INDEX(Table1[Events],SMALL(IF(INT(Table1[Start])=Month!$Q$6,MATCH(ROW(Table1[Start]),ROW(Table1[Start])),\"\"),ROW(A25))),\"\")","v":""}]
[null,{"$f":"B28+7","v":"2013-03-03"},null,{"$f":"B33+1","v":"2013-03-04"},null,{"$f":"D33+1","v":"2013-03-05"},null,{"$f":"F33+1","v":"2013-03-06"},null,{"$f":"H33+1","v":"2013-03-07"},null,{"$f":"J33+1","v":"2013-03-08"},null,{"$f":"L33+1","v":"2013-03-09"},null,null,{"$f":"IFERROR(INDEX(Table1[Start],SMALL(IF(INT(Table1[Start])=Month!$Q$6,MATCH(ROW(Table1[Start]),ROW(Table1[Start])),\"\"),ROW(A26))),\"\")","v":""},{"$f":"IFERROR(INDEX(Table1[Events],SMALL(IF(INT(Table1[Start])=Month!$Q$6,MATCH(ROW(Table1[Start]),ROW(Table1[Start])),\"\"),ROW(A26))),\"\")","v":""}]
[null,{"$f":"IFERROR(INDEX(Table1[Start],SMALL(IF(Month!B$33=INT(Table1[Start]),MATCH(ROW(Table1[Start]),ROW(Table1[Start])),\"\"),ROW(A1))),\"\")","v":""},{"$f":"IFERROR(LEFT(INDEX(Table1[Events],SMALL(IF(Month!B$33=INT(Table1[Start]),MATCH(ROW(Table1[Start]),ROW(Table1[Start])),\"\"),ROW(A1))),15),\"\")","v":""},{"$f":"IFERROR(INDEX(Table1[Start],SMALL(IF(Month!D$33=INT(Table1[Start]),MATCH(ROW(Table1[Start]),ROW(Table1[Start])),\"\"),ROW(C1))),\"\")","v":""},{"$f":"IFERROR(LEFT(INDEX(Table1[Events],SMALL(IF(Month!D$33=INT(Table1[Start]),MATCH(ROW(Table1[Start]),ROW(Table1[Start])),\"\"),ROW(C1))),15),\"\")","v":""},{"$f":"IFERROR(INDEX(Table1[Start],SMALL(IF(Month!F$33=INT(Table1[Start]),MATCH(ROW(Table1[Start]),ROW(Table1[Start])),\"\"),ROW(E1))),\"\")","v":""},{"$f":"IFERROR(LEFT(INDEX(Table1[Events],SMALL(IF(Month!F$33=INT(Table1[Start]),MATCH(ROW(Table1[Start]),ROW(Table1[Start])),\"\"),ROW(E1))),15),\"\")","v":""},{"$f":"IFERROR(INDEX(Table1[Start],SMALL(IF(Month!H$33=INT(Table1[Start]),MATCH(ROW(Table1[Start]),ROW(Table1[Start])),\"\"),ROW(G1))),\"\")","v":""},{"$f":"IFERROR(LEFT(INDEX(Table1[Events],SMALL(IF(Month!H$33=INT(Table1[Start]),MATCH(ROW(Table1[Start]),ROW(Table1[Start])),\"\"),ROW(G1))),15),\"\")","v":""},{"$f":"IFERROR(INDEX(Table1[Start],SMALL(IF(Month!J$33=INT(Table1[Start]),MATCH(ROW(Table1[Start]),ROW(Table1[Start])),\"\"),ROW(I1))),\"\")","v":""},{"$f":"IFERROR(LEFT(INDEX(Table1[Events],SMALL(IF(Month!J$33=INT(Table1[Start]),MATCH(ROW(Table1[Start]),ROW(Table1[Start])),\"\"),ROW(I1))),15),\"\")","v":""},{"$f":"IFERROR(INDEX(Table1[Start],SMALL(IF(Month!L$33=INT(Table1[Start]),MATCH(ROW(Table1[Start]),ROW(Table1[Start])),\"\"),ROW(K1))),\"\")","v":""},{"$f":"IFERROR(LEFT(INDEX(Table1[Events],SMALL(IF(Month!L$33=INT(Table1[Start]),MATCH(ROW(Table1[Start]),ROW(Table1[Start])),\"\"),ROW(K1))),15),\"\")","v":""},{"$f":"IFERROR(INDEX(Table1[Start],SMALL(IF(Month!N$33=INT(Table1[Start]),MATCH(ROW(Table1[Start]),ROW(Table1[Start])),\"\"),ROW(M1))),\"\")","v":""},{"$f":"IFERROR(LEFT(INDEX(Table1[Events],SMALL(IF(Month!N$33=INT(Table1[Start]),MATCH(ROW(Table1[Start]),ROW(Table1[Start])),\"\"),ROW(M1))),15),\"\")","v":""},null,{"$f":"IFERROR(INDEX(Table1[Start],SMALL(IF(INT(Table1[Start])=Month!$Q$6,MATCH(ROW(Table1[Start]),ROW(Table1[Start])),\"\"),ROW(A27))),\"\")","v":""},{"$f":"IFERROR(INDEX(Table1[Events],SMALL(IF(INT(Table1[Start])=Month!$Q$6,MATCH(ROW(Table1[Start]),ROW(Table1[Start])),\"\"),ROW(A27))),\"\")","v":""}]
[null,{"$f":"IFERROR(INDEX(Table1[Start],SMALL(IF(Month!B$33=INT(Table1[Start]),MATCH(ROW(Table1[Start]),ROW(Table1[Start])),\"\"),ROW(A2))),\"\")","v":""},{"$f":"IFERROR(LEFT(INDEX(Table1[Events],SMALL(IF(Month!B$33=INT(Table1[Start]),MATCH(ROW(Table1[Start]),ROW(Table1[Start])),\"\"),ROW(A2))),15),\"\")","v":""},{"$f":"IFERROR(INDEX(Table1[Start],SMALL(IF(Month!D$33=INT(Table1[Start]),MATCH(ROW(Table1[Start]),ROW(Table1[Start])),\"\"),ROW(C2))),\"\")","v":""},{"$f":"IFERROR(LEFT(INDEX(Table1[Events],SMALL(IF(Month!D$33=INT(Table1[Start]),MATCH(ROW(Table1[Start]),ROW(Table1[Start])),\"\"),ROW(C2))),15),\"\")","v":""},{"$f":"IFERROR(INDEX(Table1[Start],SMALL(IF(Month!F$33=INT(Table1[Start]),MATCH(ROW(Table1[Start]),ROW(Table1[Start])),\"\"),ROW(E2))),\"\")","v":""},{"$f":"IFERROR(LEFT(INDEX(Table1[Events],SMALL(IF(Month!F$33=INT(Table1[Start]),MATCH(ROW(Table1[Start]),ROW(Table1[Start])),\"\"),ROW(E2))),15),\"\")","v":""},{"$f":"IFERROR(INDEX(Table1[Start],SMALL(IF(Month!H$33=INT(Table1[Start]),MATCH(ROW(Table1[Start]),ROW(Table1[Start])),\"\"),ROW(G2))),\"\")","v":""},{"$f":"IFERROR(LEFT(INDEX(Table1[Events],SMALL(IF(Month!H$33=INT(Table1[Start]),MATCH(ROW(Table1[Start]),ROW(Table1[Start])),\"\"),ROW(G2))),15),\"\")","v":""},{"$f":"IFERROR(INDEX(Table1[Start],SMALL(IF(Month!J$33=INT(Table1[Start]),MATCH(ROW(Table1[Start]),ROW(Table1[Start])),\"\"),ROW(I2))),\"\")","v":""},{"$f":"IFERROR(LEFT(INDEX(Table1[Events],SMALL(IF(Month!J$33=INT(Table1[Start]),MATCH(ROW(Table1[Start]),ROW(Table1[Start])),\"\"),ROW(I2))),15),\"\")","v":""},{"$f":"IFERROR(INDEX(Table1[Start],SMALL(IF(Month!L$33=INT(Table1[Start]),MATCH(ROW(Table1[Start]),ROW(Table1[Start])),\"\"),ROW(K2))),\"\")","v":""},{"$f":"IFERROR(LEFT(INDEX(Table1[Events],SMALL(IF(Month!L$33=INT(Table1[Start]),MATCH(ROW(Table1[Start]),ROW(Table1[Start])),\"\"),ROW(K2))),15),\"\")","v":""},{"$f":"IFERROR(INDEX(Table1[Start],SMALL(IF(Month!N$33=INT(Table1[Start]),MATCH(ROW(Table1[Start]),ROW(Table1[Start])),\"\"),ROW(M2))),\"\")","v":""},{"$f":"IFERROR(LEFT(INDEX(Table1[Events],SMALL(IF(Month!N$33=INT(Table1[Start]),MATCH(ROW(Table1[Start]),ROW(Table1[Start])),\"\"),ROW(M2))),15),\"\")","v":""},null,{"$f":"IFERROR(INDEX(Table1[Start],SMALL(IF(INT(Table1[Start])=Month!$Q$6,MATCH(ROW(Table1[Start]),ROW(Table1[Start])),\"\"),ROW(A28))),\"\")","v":""},{"$f":"IFERROR(INDEX(Table1[Events],SMALL(IF(INT(Table1[Start])=Month!$Q$6,MATCH(ROW(Table1[Start]),ROW(Table1[Start])),\"\"),ROW(A28))),\"\")","v":""}]
[null,{"$f":"IFERROR(INDEX(Table1[Start],SMALL(IF(Month!B$33=INT(Table1[Start]),MATCH(ROW(Table1[Start]),ROW(Table1[Start])),\"\"),ROW(A3))),\"\")","v":""},{"$f":"IFERROR(LEFT(INDEX(Table1[Events],SMALL(IF(Month!B$33=INT(Table1[Start]),MATCH(ROW(Table1[Start]),ROW(Table1[Start])),\"\"),ROW(A3))),15),\"\")","v":""},{"$f":"IFERROR(INDEX(Table1[Start],SMALL(IF(Month!D$33=INT(Table1[Start]),MATCH(ROW(Table1[Start]),ROW(Table1[Start])),\"\"),ROW(C3))),\"\")","v":""},{"$f":"IFERROR(LEFT(INDEX(Table1[Events],SMALL(IF(Month!D$33=INT(Table1[Start]),MATCH(ROW(Table1[Start]),ROW(Table1[Start])),\"\"),ROW(C3))),15),\"\")","v":""},{"$f":"IFERROR(INDEX(Table1[Start],SMALL(IF(Month!F$33=INT(Table1[Start]),MATCH(ROW(Table1[Start]),ROW(Table1[Start])),\"\"),ROW(E3))),\"\")","v":""},{"$f":"IFERROR(LEFT(INDEX(Table1[Events],SMALL(IF(Month!F$33=INT(Table1[Start]),MATCH(ROW(Table1[Start]),ROW(Table1[Start])),\"\"),ROW(E3))),15),\"\")","v":""},{"$f":"IFERROR(INDEX(Table1[Start],SMALL(IF(Month!H$33=INT(Table1[Start]),MATCH(ROW(Table1[Start]),ROW(Table1[Start])),\"\"),ROW(G3))),\"\")","v":""},{"$f":"IFERROR(LEFT(INDEX(Table1[Events],SMALL(IF(Month!H$33=INT(Table1[Start]),MATCH(ROW(Table1[Start]),ROW(Table1[Start])),\"\"),ROW(G3))),15),\"\")","v":""},{"$f":"IFERROR(INDEX(Table1[Start],SMALL(IF(Month!J$33=INT(Table1[Start]),MATCH(ROW(Table1[Start]),ROW(Table1[Start])),\"\"),ROW(I3))),\"\")","v":""},{"$f":"IFERROR(LEFT(INDEX(Table1[Events],SMALL(IF(Month!J$33=INT(Table1[Start]),MATCH(ROW(Table1[Start]),ROW(Table1[Start])),\"\"),ROW(I3))),15),\"\")","v":""},{"$f":"IFERROR(INDEX(Table1[Start],SMALL(IF(Month!L$33=INT(Table1[Start]),MATCH(ROW(Table1[Start]),ROW(Table1[Start])),\"\"),ROW(K3))),\"\")","v":""},{"$f":"IFERROR(LEFT(INDEX(Table1[Events],SMALL(IF(Month!L$33=INT(Table1[Start]),MATCH(ROW(Table1[Start]),ROW(Table1[Start])),\"\"),ROW(K3))),15),\"\")","v":""},{"$f":"IFERROR(INDEX(Table1[Start],SMALL(IF(Month!N$33=INT(Table1[Start]),MATCH(ROW(Table1[Start]),ROW(Table1[Start])),\"\"),ROW(M3))),\"\")","v":""},{"$f":"IFERROR(LEFT(INDEX(Table1[Events],SMALL(IF(Month!N$33=INT(Table1[Start]),MATCH(ROW(Table1[Start]),ROW(Table1[Start])),\"\"),ROW(M3))),15),\"\")","v":""},null,{"$f":"IFERROR(INDEX(Table1[Start],SMALL(IF(INT(Table1[Start])=Month!$Q$6,MATCH(ROW(Table1[Start]),ROW(Table1[Start])),\"\"),ROW(A29))),\"\")","v":""},{"$f":"IFERROR(INDEX(Table1[Events],SMALL(IF(INT(Table1[Start])=Month!$Q$6,MATCH(ROW(Table1[Start]),ROW(Table1[Start])),\"\"),ROW(A29))),\"\")","v":""}]
[null,{"$f":"IFERROR(INDEX(Table1[Start],SMALL(IF(Month!B$33=INT(Table1[Start]),MATCH(ROW(Table1[Start]),ROW(Table1[Start])),\"\"),ROW(A4))),\"\")","v":""},{"$f":"IFERROR(LEFT(INDEX(Table1[Events],SMALL(IF(Month!B$33=INT(Table1[Start]),MATCH(ROW(Table1[Start]),ROW(Table1[Start])),\"\"),ROW(A4))),15),\"\")","v":""},{"$f":"IFERROR(INDEX(Table1[Start],SMALL(IF(Month!D$33=INT(Table1[Start]),MATCH(ROW(Table1[Start]),ROW(Table1[Start])),\"\"),ROW(C4))),\"\")","v":""},{"$f":"IFERROR(LEFT(INDEX(Table1[Events],SMALL(IF(Month!D$33=INT(Table1[Start]),MATCH(ROW(Table1[Start]),ROW(Table1[Start])),\"\"),ROW(C4))),15),\"\")","v":""},{"$f":"IFERROR(INDEX(Table1[Start],SMALL(IF(Month!F$33=INT(Table1[Start]),MATCH(ROW(Table1[Start]),ROW(Table1[Start])),\"\"),ROW(E4))),\"\")","v":""},{"$f":"IFERROR(LEFT(INDEX(Table1[Events],SMALL(IF(Month!F$33=INT(Table1[Start]),MATCH(ROW(Table1[Start]),ROW(Table1[Start])),\"\"),ROW(E4))),15),\"\")","v":""},{"$f":"IFERROR(INDEX(Table1[Start],SMALL(IF(Month!H$33=INT(Table1[Start]),MATCH(ROW(Table1[Start]),ROW(Table1[Start])),\"\"),ROW(G4))),\"\")","v":""},{"$f":"IFERROR(LEFT(INDEX(Table1[Events],SMALL(IF(Month!H$33=INT(Table1[Start]),MATCH(ROW(Table1[Start]),ROW(Table1[Start])),\"\"),ROW(G4))),15),\"\")","v":""},{"$f":"IFERROR(INDEX(Table1[Start],SMALL(IF(Month!J$33=INT(Table1[Start]),MATCH(ROW(Table1[Start]),ROW(Table1[Start])),\"\"),ROW(I4))),\"\")","v":""},{"$f":"IFERROR(LEFT(INDEX(Table1[Events],SMALL(IF(Month!J$33=INT(Table1[Start]),MATCH(ROW(Table1[Start]),ROW(Table1[Start])),\"\"),ROW(I4))),15),\"\")","v":""},{"$f":"IFERROR(INDEX(Table1[Start],SMALL(IF(Month!L$33=INT(Table1[Start]),MATCH(ROW(Table1[Start]),ROW(Table1[Start])),\"\"),ROW(K4))),\"\")","v":""},{"$f":"IFERROR(LEFT(INDEX(Table1[Events],SMALL(IF(Month!L$33=INT(Table1[Start]),MATCH(ROW(Table1[Start]),ROW(Table1[Start])),\"\"),ROW(K4))),15),\"\")","v":""},{"$f":"IFERROR(INDEX(Table1[Start],SMALL(IF(Month!N$33=INT(Table1[Start]),MATCH(ROW(Table1[Start]),ROW(Table1[Start])),\"\"),ROW(M4))),\"\")","v":""},{"$f":"IFERROR(LEFT(INDEX(Table1[Events],SMALL(IF(Month!N$33=INT(Table1[Start]),MATCH(ROW(Table1[Start]),ROW(Table1[Start])),\"\"),ROW(M4))),15),\"\")","v":""},null,{"$f":"IFERROR(INDEX(Table1[Start],SMALL(IF(INT(Table1[Start])=Month!$Q$6,MATCH(ROW(Table1[Start]),ROW(Table1[Start])),\"\"),ROW(A30))),\"\")","v":""},{"$f":"IFERROR(INDEX(Table1[Events],SMALL(IF(INT(Table1[Start])=Month!$Q$6,MATCH(ROW(Table1[Start]),ROW(Table1[Start])),\"\"),ROW(A30))),\"\")","v":""}]

{"sheet":"Day","index":2,"n_rows":26,"n_cols":16,"rows_kept":26,"cut":false,"hidden":false,"merged":[[1,4,1,10],[11,4,24,15],[10,4,10,15]]}
[]
[null,"Time","2013-02-07",null,{"$f":"C2","v":"2013-02-07"},null,null,null,null,null,null,null,"Year","Month","Day","Table"]
[null,{"$f":"C2","v":41312},{"$f":"IFERROR(INDEX(Table1[Events],MATCH(ROUND(B3,4),ROUND(Table1[Start],4),0)),\"\")","v":""},null,"Su","Mo","Tu","We","Th","Fr","Sa"]
[null,{"$f":"1/24+ B3","v":41312.041666666664},{"$f":"IFERROR(INDEX(Table1[Events],MATCH(ROUND(B4,4),ROUND(Table1[Start],4),0)),\"\")","v":""},null,{"$f":"DATE(Calendar!$K$2,MATCH(Month!$O$4,{\"Jan\",\"Feb\",\"Mar\",\"Apr\",\"May\",\"Jun\",\"Jul\",\"Aug\",\"Sep\",\"Oct\",\"Nov\",\"Dec\"},0),1)-WEEKDAY(DATE(Calendar!$K$2,MATCH(Month!$O$4,{\"Jan\",\"Feb\",\"Mar\",\"Apr\",\"May\",\"Jun\",\"Jul\",\"Aug\",\"Sep\",\"Oct\",\"Nov\",\"Dec\"},0),1),1)+1","v":"2013-01-27"},{"$f":"E4+1","v":"2013-01-28"},"2013-01-29","2013-01-30","2013-01-31","2013-02-01","2013-02-02"]
[null,{"$f":"1/24+ B4","v":41312.083333333328},{"$f":"IFERROR(INDEX(Table1[Events],MATCH(ROUND(B5,4),ROUND(Table1[Start],4),0)),\"\")","v":""},null,{"$f":"E4+7","v":"2013-02-03"},"2013-02-04","2013-02-05","2013-02-06","2013-02-07","2013-02-08","2013-02-09"]
[null,41312.124999999993,{"$f":"IFERROR(INDEX(Table1[Events],MATCH(ROUND(B6,4),ROUND(Table1[Start],4),0)),\"\")","v":""},null,{"$f":"E5+7","v":"2013-02-10"},"2013-02-11","2013-02-12","2013-02-13","2013-02-14","2013-02-15","2013-02-16"]
[null,41312.166666666657,{"$f":"IFERROR(INDEX(Table1[Events],MATCH(ROUND(B7,4),ROUND(Table1[Start],4),0)),\"\")","v":""},null,{"$f":"E6+7","v":"2013-02-17"},"2013-02-18","2013-02-19","2013-02-20","2013-02-21","2013-02-22","2013-02-23"]
[null,41312.208333333321,{"$f":"IFERROR(INDEX(Table1[Events],MATCH(ROUND(B8,4),ROUND(Table1[Start],4),0)),\"\")","v":""},null,{"$f":"E7+7","v":"2013-02-24"},"2013-02-25","2013-02-26","2013-02-27","2013-02-28","2013-03-01","2013-03-02"]
[null,41312.249999999985,{"$f":"IFERROR(INDEX(Table1[Events],MATCH(ROUND(B9,4),ROUND(Table1[Start],4),0)),\"\")","v":""},null,{"$f":"E8+7","v":"2013-03-03"},"2013-03-04","2013-03-05","2013-03-06","2013-03-07","2013-03-08","2013-03-09"]
[null,41312.29166666665,{"$f":"IFERROR(INDEX(Table1[Events],MATCH(ROUND(B10,4),ROUND(Table1[Start],4),0)),\"\")","v":""}]
[null,41312.333333333314,{"$f":"IFERROR(INDEX(Table1[Events],MATCH(ROUND(B11,4),ROUND(Table1[Start],4),0)),\"\")","v":"Event 3"},null,"2013-02-07T09:00:00"]
[null,41312.374999999978,{"$f":"IFERROR(INDEX(Table1[Events],MATCH(ROUND(B12,4),ROUND(Table1[Start],4),0)),\"\")","v":"Event 11"},null,{"$f":"IFERROR(INDEX(Table1[Events],MATCH(ROUND(E11,4),ROUND(Table1[Start],4),0)),\"\")","v":"Event 11"}]
[null,41312.416666666642,{"$f":"IFERROR(INDEX(Table1[Events],MATCH(ROUND(B13,4),ROUND(Table1[Start],4),0)),\"\")","v":""}]
[null,41312.458333333307,{"$f":"IFERROR(INDEX(Table1[Events],MATCH(ROUND(B14,4),ROUND(Table1[Start],4),0)),\"\")","v":""}]
[null,41312.499999999971,{"$f":"IFERROR(INDEX(Table1[Events],MATCH(ROUND(B15,4),ROUND(Table1[Start],4),0)),\"\")","v":""}]
[null,41312.541666666635,{"$f":"IFERROR(INDEX(Table1[Events],MATCH(ROUND(B16,4),ROUND(Table1[Start],4),0)),\"\")","v":""}]
[null,41312.583333333299,{"$f":"IFERROR(INDEX(Table1[Events],MATCH(ROUND(B17,4),ROUND(Table1[Start],4),0)),\"\")","v":""}]
[null,41312.624999999964,{"$f":"IFERROR(INDEX(Table1[Events],MATCH(ROUND(B18,4),ROUND(Table1[Start],4),0)),\"\")","v":""}]
[null,41312.666666666628,{"$f":"IFERROR(INDEX(Table1[Events],MATCH(ROUND(B19,4),ROUND(Table1[Start],4),0)),\"\")","v":""}]
[null,41312.708333333292,{"$f":"IFERROR(INDEX(Table1[Events],MATCH(ROUND(B20,4),ROUND(Table1[Start],4),0)),\"\")","v":""}]
[null,41312.749999999956,{"$f":"IFERROR(INDEX(Table1[Events],MATCH(ROUND(B21,4),ROUND(Table1[Start],4),0)),\"\")","v":""}]
[null,41312.791666666621,{"$f":"IFERROR(INDEX(Table1[Events],MATCH(ROUND(B22,4),ROUND(Table1[Start],4),0)),\"\")","v":""}]
[null,41312.833333333285,{"$f":"IFERROR(INDEX(Table1[Events],MATCH(ROUND(B23,4),ROUND(Table1[Start],4),0)),\"\")","v":""}]
[null,41312.874999999949,{"$f":"IFERROR(INDEX(Table1[Events],MATCH(ROUND(B24,4),ROUND(Table1[Start],4),0)),\"\")","v":""}]
[null,41312.916666666613,{"$f":"IFERROR(INDEX(Table1[Events],MATCH(ROUND(B25,4),ROUND(Table1[Start],4),0)),\"\")","v":""}]
[null,41312.958333333278,{"$f":"IFERROR(INDEX(Table1[Events],MATCH(ROUND(B26,4),ROUND(Table1[Start],4),0)),\"\")","v":""}]

{"sheet":"Table","index":3,"n_rows":23,"n_cols":4,"rows_kept":23,"cut":false,"hidden":false,"merged":[]}
[]
[null,"Start","End","Events"]
[null,"2013-01-08T09:00:00","2013-01-08T12:00:00","Event 1"]
[null,"2013-01-09T08:00:00","2013-01-09T21:00:00","Event 9"]
[null,"2013-01-09T08:00:00","2013-01-09T09:00:00","Event 10"]
[null,"2013-02-07T08:00:00","2013-02-07T08:00:00","Event 3"]
[null,"2013-02-07T09:00:00","2013-02-07T10:00:00","Event 11"]
[null,"2013-02-08T08:00:00","2013-02-08T09:00:00","Event 12"]
[null,"2013-02-08T10:00:00","2013-02-08T12:00:00","Event 13"]
[null,"2013-02-25T08:00:00","2013-02-25T16:00:00","Event 2"]
[null,"2013-03-18T10:00:00","2013-03-18T21:00:00","Event 4"]
[null,"2013-03-24T10:00:00","2013-03-24T21:00:00","Event 14"]
[null,"2013-04-01T12:00:00","2013-04-01T10:00:00","Event 5"]
[null,"2013-04-02T12:00:00","2013-04-02T14:00:00","Event 15"]
[null,"2013-05-14T18:00:00","2013-05-14T21:00:00","Event 16"]
[null,"2013-05-14T18:00:00","2013-05-14T19:00:00","Event 17"]
[null,"2013-05-27T18:00:00","2013-05-27T08:00:00","Event 6"]
[null,"2013-06-13T08:00:00","2013-06-13T16:00:00","Event 7"]
[null,"2013-06-23T15:00:00","2013-06-23T12:00:00","Event 8"]
[null,"2013-06-24T18:00:00","2013-06-24T19:00:00","Event 18"]
[null,"2013-07-07T18:00:00","2013-07-07T21:00:00","Event 19"]
[null,"2013-07-17T18:00:00","2013-07-17T20:00:00","Event 20"]
[null,"2013-09-09T08:00:00","2013-09-09T20:00:00","Event 21"]