{"text_format":"1","workbook":"xlsx","n_sheets":5,"sheets":["Map","Items","Paths","Optimize total path","Optimize total path (2)"],"not_rendered":{"charts":0,"images":0,"macros":1,"external_links":0,"defined_names":79,"comments":0,"pivot_tables":0},"unopened":[],"bounds":{"document_bytes":16777216,"sheet_cells":100000,"rows_first":2000,"rows_last":500,"rows_between":2000,"halvings":0,"cell_chars":16384,"cell_head_chars":4096},"cells_cut":0,"cells_raw":0,"read":"whole","date_system":"1900"}

{"sheet":"Map","index":0,"n_rows":139,"n_cols":171,"rows_kept":139,"cut":false,"hidden":false,"merged":[]}
[]
[null,null,null,null,null,null,null,null,null,null,null,null,null,null,null,null,null,null,null,null,null,null,null,null,null,null,null,null,null,null,null,null,null,null,null,null,null,null,null,null,null,null,null,null,null,null,null,null,null,null,null,null,null,null,null,null,null,null,null,null,null,null,null,null,null,null,null,null,null,null,null,null,null,null,null,null,null,null,null,null,null,null,null,null,null,null,null,null,1]
[]
[]
[]
[]
[]
[]
[]
[null,null,null,null,null,null,null,null,null,null,null,null,null,1,1,null,null,1,1,null,null,1,1,null,null,1,1,null,null,1,1,null,null,1,1,null,null,1,1,null,null,1,1,null,null,1,1,null,null,1,1,null,null,1,1,null,null,1,1,null,null,1,1,null,null,1,1,null,null,1,1,null,null,1,1,null,null,1,1,null,null,1,1,null,null,1,1,null,null,1,1,null,null,1,1,null,null,1,1,null,null,1,1,null,null,1,1,null,null,1,1,null,null,1,1,null,null,1,1,null,null,1,1,null,null,1,1,null,null,1,1,null,null,1,1,null,null,1,1,null,null,1,1,null,null,1,1,null,null,1,1,null,null,1,1,null,null,1,1,null,null,1,1,null,null,1,1,null,null,1,1]
[null,null,null,null,null,null,null,null,null,null,null,null,null,1,1,null,null,1,1,null,null,1,1,null,null,1,1,null,null,1,1,null,null,1,1,null,null,1,1,null,null,1,1,null,null,1,1,null,null,1,1,null,null,1,1,null,null,1,1,null,null,1,1,null,null,1,1,null,null,1,1,null,null,1,1,null,null,1,1,null,null,1,1,null,null,1,1,null,null,1,1,null,null,1,1,null,null,1,1,null,null,1,1,null,null,1,1,null,null,1,1,null,null,1,1,null,null,1,1,null,null,1,1,null,null,1,1,null,null,1,1,null,null,1,1,null,null,1,1,null,null,1,1,null,null,1,1,null,null,1,1,null,null,1,1,null,null,1,1,null,null,1,1,null,null,1,1,null,null,1,1]
[null,null,null,null,null,null,null,null,null,null,null,null,null,1,1,null,null,1,1,null,null,1,1,null,null,1,1,null,null,1,1,null,null,1,1,null,null,1,1,null,null,1,1,null,null,1,1,null,null,1,1,null,null,1,1,null,null,1,1,null,null,1,1,null,null,1,1,null,null,1,1,null,null,1,1,null,null,1,1,null,null,1,1,null,null,1,1,null,null,1,1,null,null,1,1,null,null,1,1,null,null,1,1,null,null,1,1,null,null,1,1,null,null,1,1,null,null,1,1,null,null,1,1,null,null,1,1,null,null,1,1,null,null,1,1,null,null,1,1,null,null,1,1,null,null,1,1,null,null,1,1,null,null,1,1,null,null,1,1,null,null,1,1,null,null,1,1,null,null,1,1]
[null,null,null,null,null,null,null,null,null,null,null,null,null,1,1,null,null,1,1,null,null,1,1,null,null,1,1,null,null,1,1,null,null,1,1,null,null,1,1,null,null,1,1,null,null,1,1,null,null,1,1,null,null,1,1,null,null,1,1,null,null,1,1,null,null,1,1,null,null,1,1,null,null,1,1,null,null,1,1,null,null,1,1,null,null,1,1,null,null,1,1,null,null,1,1,null,null,1,1,null,null,1,1,null,null,1,1,null,null,1,1,null,null,1,1,null,null,1,1,null,null,1,1,null,null,1,1,null,null,1,1,null,null,1,1,null,null,1,1,null,null,1,1,null,null,1,1,null,null,1,1,null,null,1,1,null,null,1,1,null,null,1,1,null,null,1,1,null,null,1,1]
[null,null,null,null,null,null,null,null,null,null,null,null,null,1,1,null,null,1,1,null,null,1,1,null,null,1,1,null,null,1,1,null,null,1,1,null,null,1,1,null,null,1,1,null,null,1,1,null,null,1,1,null,null,1,1,null,null,1,1,null,null,1,1,null,null,1,1,null,null,1,1,null,null,1,1,null,null,1,1,null,null,1,1,null,null,1,1,null,null,1,1,null,null,1,1,null,null,1,1,null,null,1,1,null,null,1,1,null,null,1,1,null,null,1,1,null,null,1,1,null,null,1,1,null,null,1,1,null,null,1,1,null,null,1,1,null,null,1,1,null,null,1,1,null,null,1,1,null,null,1,1,null,null,1,1,null,null,1,1,null,null,1,1,null,null,1,1,null,null,1,1]
[null,null,null,null,null,null,null,null,null,null,null,null,null,1,1,null,null,1,1,null,null,1,1,null,null,1,1,null,null,1,1,null,null,1,1,null,null,1,1,null,null,1,1,null,null,1,1,null,null,1,1,null,null,1,1,null,null,1,1,null,null,1,1,null,null,1,1,null,null,1,1,null,null,1,1,null,null,1,1,null,null,1,1,null,null,1,1,null,null,1,1,null,null,1,1,null,null,1,1,null,null,1,1,null,null,1,1,null,null,1,1,null,null,1,1,null,null,1,1,null,null,1,1,null,null,1,1,null,null,1,1,null,null,1,1,null,null,1,1,null,null,1,1,null,null,1,1,null,null,1,1,null,null,1,1,null,null,1,1,null,null,1,1,null,null,1,1,null,null,1,1]
[null,null,null,null,null,null,null,null,null,null,null,null,null,1,1,null,null,1,1,null,null,1,1,null,null,1,1,null,null,1,1,null,null,1,1,null,null,1,1,null,null,1,1,null,null,1,1,null,null,1,1,null,null,1,1,null,null,1,1,null,null,1,1,null,null,1,1,null,null,1,1,null,null,1,1,null,null,1,1,null,null,1,1,null,null,1,1,null,null,1,1,null,null,1,1,null,null,1,1,null,null,1,1,null,null,1,1,null,null,1,1,null,null,1,1,null,null,1,1,null,null,1,1,null,null,1,1,null,null,1,1,null,null,1,1,null,null,1,1,null,null,1,1,null,null,1,1,null,null,1,1,null,null,1,1,null,null,1,1,null,null,1,1,null,null,1,1,null,null,1,1]
[null,null,null,null,null,null,null,null,null,null,null,null,null,1,1,null,null,1,1,null,null,1,1,null,null,1,1,null,null,1,1,null,null,1,1,null,null,1,1,null,null,1,1,null,null,1,1,null,null,1,1,null,null,1,1,null,null,1,1,null,null,1,1,null,null,1,1,null,null,1,1,null,null,1,1,null,null,1,1,null,null,1,1,null,null,1,1,null,null,1,1,null,null,1,1,null,null,1,1,null,null,1,1,null,null,1,1,null,null,1,1,null,null,1,1,null,null,1,1,null,null,1,1,null,null,1,1,null,null,1,1,null,null,1,1,null,null,1,1,null,null,1,1,null,null,1,1,null,null,1,1,null,null,1,1,null,null,1,1,null,null,1,1,null,null,1,1,null,null,1,1]
[null,null,null,null,null,null,null,null,null,null,null,null,null,1,1,null,null,1,1,null,null,1,1,null,null,1,1,null,null,1,1,null,null,1,1,null,null,1,1,null,null,1,1,null,null,1,1,null,null,1,1,null,null,1,1,null,null,1,1,null,null,1,1,null,null,1,1,null,null,1,1,null,null,1,1,null,null,1,1,null,null,1,1,null,null,1,1,null,null,1,1,null,null,1,1,null,null,1,1,null,null,1,1,null,null,1,1,null,null,1,1,null,null,1,1,null,null,1,1,null,null,1,1,null,null,1,1,null,null,1,1,null,null,1,1,null,null,1,1,null,null,1,1,null,null,1,1,null,null,1,1,null,null,1,1,null,null,1,1,null,null,1,1,null,null,1,1,null,null,1,1]
[null,null,null,null,null,null,null,null,null,null,null,null,null,1,1,null,null,1,1,null,null,1,1,null,null,1,1,null,null,1,1,null,null,1,1,null,null,1,1,null,null,1,1,null,null,1,1,null,null,1,1,null,null,1,1,null,null,1,1,null,null,1,1,null,null,1,1,null,null,1,1,null,null,1,1,null,null,1,1,null,null,1,1,null,null,1,1,null,null,1,1,null,null,1,1,null,null,1,1,null,null,1,1,null,null,1,1,null,null,1,1,null,null,1,1,null,null,1,1,null,null,1,1,null,null,1,1,null,null,1,1,null,null,1,1,null,null,1,1,null,null,1,1,null,null,1,1,null,null,1,1,null,null,1,1,null,null,1,1,null,null,1,1,null,null,1,1,null,null,1,1]
[null,null,null,null,null,null,null,null,null,null,null,null,null,1,1,null,null,1,1,null,null,1,1,null,null,1,1,null,null,1,1,null,null,1,1,null,null,1,1,null,null,1,1,null,null,1,1,null,null,1,1,null,null,1,1,null,null,1,1,null,null,1,1,null,null,1,1,null,null,1,1,null,null,1,1,null,null,1,1,null,null,1,1,null,null,1,1,null,null,1,1,null,null,1,1,null,null,1,1,null,null,1,1,null,null,1,1,null,null,1,1,null,null,1,1,null,null,1,1,null,null,1,1,null,null,1,1,null,null,1,1,null,null,1,1,null,null,1,1,null,null,1,1,null,null,1,1,null,null,1,1,null,null,1,1,null,null,1,1,null,null,1,1,null,null,1,1,null,null,1,1]
{"$rows_left_out":120}
{"sheet":"Items","index":1,"n_rows":9602,"n_cols":10,"rows_kept":9602,"cut":false,"hidden":false,"merged":[]}
[]
[null,"Item","Row","Column",null,null,"#","15 random items","Row","Column"]
[null,1,10,14,null,null,0,"Start",2,89]
[null,2,11,14,null,null,1,539,{"$f":"INDEX($C$3:$C$9602,MATCH($H4,$B$3:$B$9602,0))","v":73},{"$f":"INDEX($D$3:$D$9602,MATCH($H4,$B$3:$B$9602,0))","v":22}]
[null,3,12,14,null,null,2,808,107,26]
[null,4,13,14,null,null,3,2035,134,46]
[null,5,14,14,null,null,4,2091,65,47]
[null,6,15,14,null,null,5,3054,68,63]
[null,7,16,14,null,null,6,3089,108,63]
[null,8,17,14,null,null,7,4124,58,82]
[null,9,18,14,null,null,8,4307,126,83]
[null,10,19,14,null,null,9,4641,100,90]
[null,11,20,14,null,null,10,5886,15,111]
[null,12,21,14,null,null,11,6256,25,118]
[null,13,22,14,null,null,12,6594,133,122]
[null,14,23,14,null,null,13,7414,113,135]
[null,15,24,14,null,null,14,7603,57,139]
[null,16,25,14]
[null,17,26,14]
[null,18,27,14]
{"$rows_left_out":9583}
{"sheet":"Paths","index":2,"n_rows":41,"n_cols":21,"rows_kept":41,"cut":false,"hidden":false,"merged":[[0,2,0,16],[2,0,16,0]]}
[null,null,"Items",null,null,null,null,null,null,null,null,null,null,null,null,null,null,null,null,"Row","Column"]
[null,null,"Start",539,808,2035,2091,3054,3089,4124,4307,4641,5886,6256,6594,7414,7603,null,"Start",2,89]
["Items","Start",null,129.21320343559637,155.11269837220811,162.11269837220806,93.627416997969505,80.627416997969505,116.52691193458115,58.899494936611646,125.07106781186546,97,30.313708498984766,44.727922061357859,148.52691193458116,144.11269837220809,96.213203435596384,null,"End",57,139]
[null,539,129.2132034355964,null,35.071067811865476,80.313708498984752,55.242640687119284,74.242640687119291,73.89949493661166,80.656854249492369,111.89949493661165,91.485281374238554,144.89949493661163,139.31370849898474,155.31370849898474,150.89949493661172,139.24264068711929]
[null,808,155.11269837220817,35.071067811865476,null,56.656854249492369,60.899494936611667,73.89949493661166,54.242640687119284,100.31370849898475,92.242640687119277,71.828427124746185,170.79898987322338,165.21320343559648,133.6568542494924,131.24264068711926,160.89949493661163]
[null,2035,162.11269837220814,80.313708498984738,56.656854249492383,null,69.656854249492369,80.899494936611646,55.242640687119291,107.31370849898474,57.242640687119284,78.828427124746185,177.79898987322338,172.21320343559648,86.656854249492369,122.24264068711928,167.89949493661169]
[null,2091,93.62741699796949,55.242640687119284,60.899494936611653,69.656854249492369,null,38.656854249492383,54.313708498984752,45.071067811865476,92.313708498984752,71.89949493661166,109.31370849898475,103.72792206135784,135.72792206135784,131.31370849898474,103.65685424949238]
[null,3054,80.627416997969505,74.242640687119291,73.89949493661166,80.89949493661166,38.656854249492383,null,39.414213562373092,32.071067811865476,73.313708498984752,52.89949493661166,96.313708498984752,90.727922061357845,116.72792206135784,112.31370849898475,90.656854249492383]
[null,3089,116.52691193458115,73.89949493661166,54.242640687119284,55.242640687119284,54.313708498984766,39.414213562373092,null,61.727922061357859,53.656854249492383,33.242640687119284,132.21320343559637,126.62741699796948,93.071067811865476,92.656854249492383,122.31370849898475]
[null,4124,59.14213562373093,80.656854249492369,100.31370849898474,107.31370849898474,45.071067811865468,32.071067811865476,61.72792206135783,null,68.656854249492369,46.485281374238554,69.89949493661166,64.313708498984752,110.31370849898474,105.89949493661165,64.242640687119291]
[null,4307,125.07106781186546,111.89949493661165,92.242640687119277,57.242640687119284,92.313708498984752,73.313708498984752,53.656854249492376,68.656854249492369,null,31.242640687119287,130.2132034355964,124.62741699796949,55.071067811865476,90.656854249492383,120.31370849898475]
[null,4641,97.414213562373092,91.485281374238554,71.828427124746185,78.828427124746185,71.899494936611646,52.899494936611667,33.242640687119284,46.485281374238568,31.242640687119287,null,98.384776310850228,92.79898987322332,63.242640687119284,58.828427124746185,88.485281374238554]
[null,5886,30.313708498984766,144.89949493661163,170.79898987322338,177.79898987322338,109.31370849898474,96.313708498984738,132.2132034355964,69.899494936611646,130.2132034355964,98.384776310850199,null,24.071067811865476,121.72792206135783,113.21320343559638,65.313708498984738]
[null,6256,44.727922061357845,139.31370849898474,165.21320343559648,172.21320343559648,103.72792206135784,90.727922061357845,126.62741699796949,64.313708498984752,124.62741699796949,92.798989873223306,24.071067811865479,null,109.07106781186546,98.798989873223306,50.899494936611653]
[null,6594,149.11269837220811,155.31370849898479,133.65685424949237,86.656854249492383,135.72792206135784,116.72792206135783,93.071067811865461,110.31370849898474,55.071067811865468,63.242640687119277,121.72792206135783,109.07106781186546,null,47.242640687119291,90.899494936611646]
[null,7414,144.69848480983507,150.89949493661169,131.24264068711926,122.24264068711928,131.31370849898474,112.31370849898474,92.656854249492369,105.89949493661166,90.656854249492383,58.828427124746192,113.21320343559641,98.79898987322332,47.242640687119284,null,57.071067811865476]
[null,7603,96.798989873223306,139.24264068711926,160.89949493661172,167.89949493661172,103.65685424949237,90.656854249492369,122.31370849898474,64.242640687119291,120.31370849898474,88.485281374238554,65.313708498984766,50.899494936611674,90.899494936611646,57.071067811865461]
[]
[]
[]
{"$rows_left_out":22}
{"sheet":"Optimize total path","index":3,"n_rows":19,"n_cols":4,"rows_kept":19,"cut":false,"hidden":false,"merged":[]}
[]
[null,"#","Sequence","Distance"]
[null,0,"Start",0]
[null,1,{"$f":"INDEX(Items!$H$4:$H$17,MATCH('Optimize total path'!B4,Items!$G$4:$G$17,0))","v":539},{"$f":"INDEX(Paths!$C$3:$Q$17,MATCH('Optimize total path'!C3,Paths!$B$3:$B$17,0),MATCH('Optimize total path'!C4,Paths!$C$2:$Q$2,0))","v":129.21320343559637}]
[null,2,{"$f":"INDEX(Items!$H$4:$H$17,MATCH('Optimize total path'!B5,Items!$G$4:$G$17,0))","v":808},{"$f":"INDEX(Paths!$C$3:$Q$17,MATCH('Optimize total path'!C4,Paths!$B$3:$B$17,0),MATCH('Optimize total path'!C5,Paths!$C$2:$Q$2,0))","v":35.071067811865476}]
[null,3,{"$f":"INDEX(Items!$H$4:$H$17,MATCH('Optimize total path'!B6,Items!$G$4:$G$17,0))","v":2035},{"$f":"INDEX(Paths!$C$3:$Q$17,MATCH('Optimize total path'!C5,Paths!$B$3:$B$17,0),MATCH('Optimize total path'!C6,Paths!$C$2:$Q$2,0))","v":56.656854249492369}]
[null,4,{"$f":"INDEX(Items!$H$4:$H$17,MATCH('Optimize total path'!B7,Items!$G$4:$G$17,0))","v":2091},{"$f":"INDEX(Paths!$C$3:$Q$17,MATCH('Optimize total path'!C6,Paths!$B$3:$B$17,0),MATCH('Optimize total path'!C7,Paths!$C$2:$Q$2,0))","v":69.656854249492369}]
[null,5,{"$f":"INDEX(Items!$H$4:$H$17,MATCH('Optimize total path'!B8,Items!$G$4:$G$17,0))","v":3054},{"$f":"INDEX(Paths!$C$3:$Q$17,MATCH('Optimize total path'!C7,Paths!$B$3:$B$17,0),MATCH('Optimize total path'!C8,Paths!$C$2:$Q$2,0))","v":38.656854249492383}]
[null,6,{"$f":"INDEX(Items!$H$4:$H$17,MATCH('Optimize total path'!B9,Items!$G$4:$G$17,0))","v":3089},{"$f":"INDEX(Paths!$C$3:$Q$17,MATCH('Optimize total path'!C8,Paths!$B$3:$B$17,0),MATCH('Optimize total path'!C9,Paths!$C$2:$Q$2,0))","v":39.414213562373092}]
[null,7,{"$f":"INDEX(Items!$H$4:$H$17,MATCH('Optimize total path'!B10,Items!$G$4:$G$17,0))","v":4124},{"$f":"INDEX(Paths!$C$3:$Q$17,MATCH('Optimize total path'!C9,Paths!$B$3:$B$17,0),MATCH('Optimize total path'!C10,Paths!$C$2:$Q$2,0))","v":61.727922061357859}]
[null,8,{"$f":"INDEX(Items!$H$4:$H$17,MATCH('Optimize total path'!B11,Items!$G$4:$G$17,0))","v":4307},{"$f":"INDEX(Paths!$C$3:$Q$17,MATCH('Optimize total path'!C10,Paths!$B$3:$B$17,0),MATCH('Optimize total path'!C11,Paths!$C$2:$Q$2,0))","v":68.656854249492369}]
[null,9,{"$f":"INDEX(Items!$H$4:$H$17,MATCH('Optimize total path'!B12,Items!$G$4:$G$17,0))","v":4641},{"$f":"INDEX(Paths!$C$3:$Q$17,MATCH('Optimize total path'!C11,Paths!$B$3:$B$17,0),MATCH('Optimize total path'!C12,Paths!$C$2:$Q$2,0))","v":31.242640687119287}]
[null,10,{"$f":"INDEX(Items!$H$4:$H$17,MATCH('Optimize total path'!B13,Items!$G$4:$G$17,0))","v":5886},{"$f":"INDEX(Paths!$C$3:$Q$17,MATCH('Optimize total path'!C12,Paths!$B$3:$B$17,0),MATCH('Optimize total path'!C13,Paths!$C$2:$Q$2,0))","v":98.384776310850228}]
[null,11,{"$f":"INDEX(Items!$H$4:$H$17,MATCH('Optimize total path'!B14,Items!$G$4:$G$17,0))","v":6256},{"$f":"INDEX(Paths!$C$3:$Q$17,MATCH('Optimize total path'!C13,Paths!$B$3:$B$17,0),MATCH('Optimize total path'!C14,Paths!$C$2:$Q$2,0))","v":24.071067811865476}]
[null,12,{"$f":"INDEX(Items!$H$4:$H$17,MATCH('Optimize total path'!B15,Items!$G$4:$G$17,0))","v":6594},{"$f":"INDEX(Paths!$C$3:$Q$17,MATCH('Optimize total path'!C14,Paths!$B$3:$B$17,0),MATCH('Optimize total path'!C15,Paths!$C$2:$Q$2,0))","v":109.07106781186546}]
[null,13,{"$f":"INDEX(Items!$H$4:$H$17,MATCH('Optimize total path'!B16,Items!$G$4:$G$17,0))","v":7414},{"$f":"INDEX(Paths!$C$3:$Q$17,MATCH('Optimize total path'!C15,Paths!$B$3:$B$17,0),MATCH('Optimize total path'!C16,Paths!$C$2:$Q$2,0))","v":47.242640687119291}]
[null,14,{"$f":"INDEX(Items!$H$4:$H$17,MATCH('Optimize total path'!B17,Items!$G$4:$G$17,0))","v":7603},{"$f":"INDEX(Paths!$C$3:$Q$17,MATCH('Optimize total path'!C16,Paths!$B$3:$B$17,0),MATCH('Optimize total path'!C17,Paths!$C$2:$Q$2,0))","v":57.071067811865476}]
[null,0,"Start",{"$f":"INDEX(Paths!$C$3:$Q$17,MATCH('Optimize total path'!C17,Paths!$B$3:$B$17,0),MATCH('Optimize total path'!C18,Paths!$C$2:$Q$2,0))","v":96.798989873223306}]
[null,null,"Total distance:",{"$f":"SUM(D3:D18)","v":962.93607486307064}]

{"sheet":"Optimize total path (2)","index":4,"n_rows":19,"n_cols":6,"rows_kept":19,"cut":false,"hidden":false,"merged":[]}
[]
[null,"#","Sequence","Distance","Row","Column"]
[null,0,"Start",0,{"$f":"INDEX(Items!$I$3:$I$17,MATCH('Optimize total path (2)'!C3,Items!$H$3:$H$17,0))","v":2},{"$f":"INDEX(Items!$J$3:$J$17,MATCH('Optimize total path (2)'!C3,Items!$H$3:$H$17,0))","v":89}]
[null,10,{"$f":"INDEX(Items!$H$4:$H$17,MATCH('Optimize total path (2)'!B4,Items!$G$4:$G$17,0))","v":5886},{"$f":"INDEX(Paths!$C$3:$Q$17,MATCH('Optimize total path (2)'!C3,Paths!$B$3:$B$17,0),MATCH('Optimize total path (2)'!C4,Paths!$C$2:$Q$2,0))","v":30.313708498984766},{"$f":"INDEX(Items!$I$3:$I$17,MATCH('Optimize total path (2)'!C4,Items!$H$3:$H$17,0))","v":15},{"$f":"INDEX(Items!$J$3:$J$17,MATCH('Optimize total path (2)'!C4,Items!$H$3:$H$17,0))","v":111}]
[null,11,{"$f":"INDEX(Items!$H$4:$H$17,MATCH('Optimize total path (2)'!B5,Items!$G$4:$G$17,0))","v":6256},{"$f":"INDEX(Paths!$C$3:$Q$17,MATCH('Optimize total path (2)'!C4,Paths!$B$3:$B$17,0),MATCH('Optimize total path (2)'!C5,Paths!$C$2:$Q$2,0))","v":24.071067811865476},{"$f":"INDEX(Items!$I$3:$I$17,MATCH('Optimize total path (2)'!C5,Items!$H$3:$H$17,0))","v":25},{"$f":"INDEX(Items!$J$3:$J$17,MATCH('Optimize total path (2)'!C5,Items!$H$3:$H$17,0))","v":118}]
[null,14,{"$f":"INDEX(Items!$H$4:$H$17,MATCH('Optimize total path (2)'!B6,Items!$G$4:$G$17,0))","v":7603},{"$f":"INDEX(Paths!$C$3:$Q$17,MATCH('Optimize total path (2)'!C5,Paths!$B$3:$B$17,0),MATCH('Optimize total path (2)'!C6,Paths!$C$2:$Q$2,0))","v":50.899494936611653},{"$f":"INDEX(Items!$I$3:$I$17,MATCH('Optimize total path (2)'!C6,Items!$H$3:$H$17,0))","v":57},{"$f":"INDEX(Items!$J$3:$J$17,MATCH('Optimize total path (2)'!C6,Items!$H$3:$H$17,0))","v":139}]
[null,13,{"$f":"INDEX(Items!$H$4:$H$17,MATCH('Optimize total path (2)'!B7,Items!$G$4:$G$17,0))","v":7414},{"$f":"INDEX(Paths!$C$3:$Q$17,MATCH('Optimize total path (2)'!C6,Paths!$B$3:$B$17,0),MATCH('Optimize total path (2)'!C7,Paths!$C$2:$Q$2,0))","v":57.071067811865461},{"$f":"INDEX(Items!$I$3:$I$17,MATCH('Optimize total path (2)'!C7,Items!$H$3:$H$17,0))","v":113},{"$f":"INDEX(Items!$J$3:$J$17,MATCH('Optimize total path (2)'!C7,Items!$H$3:$H$17,0))","v":135}]
[null,12,{"$f":"INDEX(Items!$H$4:$H$17,MATCH('Optimize total path (2)'!B8,Items!$G$4:$G$17,0))","v":6594},{"$f":"INDEX(Paths!$C$3:$Q$17,MATCH('Optimize total path (2)'!C7,Paths!$B$3:$B$17,0),MATCH('Optimize total path (2)'!C8,Paths!$C$2:$Q$2,0))","v":47.242640687119284},{"$f":"INDEX(Items!$I$3:$I$17,MATCH('Optimize total path (2)'!C8,Items!$H$3:$H$17,0))","v":133},{"$f":"INDEX(Items!$J$3:$J$17,MATCH('Optimize total path (2)'!C8,Items!$H$3:$H$17,0))","v":122}]
[null,8,{"$f":"INDEX(Items!$H$4:$H$17,MATCH('Optimize total path (2)'!B9,Items!$G$4:$G$17,0))","v":4307},{"$f":"INDEX(Paths!$C$3:$Q$17,MATCH('Optimize total path (2)'!C8,Paths!$B$3:$B$17,0),MATCH('Optimize total path (2)'!C9,Paths!$C$2:$Q$2,0))","v":55.071067811865468},{"$f":"INDEX(Items!$I$3:$I$17,MATCH('Optimize total path (2)'!C9,Items!$H$3:$H$17,0))","v":126},{"$f":"INDEX(Items!$J$3:$J$17,MATCH('Optimize total path (2)'!C9,Items!$H$3:$H$17,0))","v":83}]
[null,9,{"$f":"INDEX(Items!$H$4:$H$17,MATCH('Optimize total path (2)'!B10,Items!$G$4:$G$17,0))","v":4641},{"$f":"INDEX(Paths!$C$3:$Q$17,MATCH('Optimize total path (2)'!C9,Paths!$B$3:$B$17,0),MATCH('Optimize total path (2)'!C10,Paths!$C$2:$Q$2,0))","v":31.242640687119287},{"$f":"INDEX(Items!$I$3:$I$17,MATCH('Optimize total path (2)'!C10,Items!$H$3:$H$17,0))","v":100},{"$f":"INDEX(Items!$J$3:$J$17,MATCH('Optimize total path (2)'!C10,Items!$H$3:$H$17,0))","v":90}]
[null,6,{"$f":"INDEX(Items!$H$4:$H$17,MATCH('Optimize total path (2)'!B11,Items!$G$4:$G$17,0))","v":3089},{"$f":"INDEX(Paths!$C$3:$Q$17,MATCH('Optimize total path (2)'!C10,Paths!$B$3:$B$17,0),MATCH('Optimize total path (2)'!C11,Paths!$C$2:$Q$2,0))","v":33.242640687119284},{"$f":"INDEX(Items!$I$3:$I$17,MATCH('Optimize total path (2)'!C11,Items!$H$3:$H$17,0))","v":108},{"$f":"INDEX(Items!$J$3:$J$17,MATCH('Optimize total path (2)'!C11,Items!$H$3:$H$17,0))","v":63}]
[null,3,{"$f":"INDEX(Items!$H$4:$H$17,MATCH('Optimize total path (2)'!B12,Items!$G$4:$G$17,0))","v":2035},{"$f":"INDEX(Paths!$C$3:$Q$17,MATCH('Optimize total path (2)'!C11,Paths!$B$3:$B$17,0),MATCH('Optimize total path (2)'!C12,Paths!$C$2:$Q$2,0))","v":55.242640687119284},{"$f":"INDEX(Items!$I$3:$I$17,MATCH('Optimize total path (2)'!C12,Items!$H$3:$H$17,0))","v":134},{"$f":"INDEX(Items!$J$3:$J$17,MATCH('Optimize total path (2)'!C12,Items!$H$3:$H$17,0))","v":46}]
[null,2,{"$f":"INDEX(Items!$H$4:$H$17,MATCH('Optimize total path (2)'!B13,Items!$G$4:$G$17,0))","v":808},{"$f":"INDEX(Paths!$C$3:$Q$17,MATCH('Optimize total path (2)'!C12,Paths!$B$3:$B$17,0),MATCH('Optimize total path (2)'!C13,Paths!$C$2:$Q$2,0))","v":56.656854249492383},{"$f":"INDEX(Items!$I$3:$I$17,MATCH('Optimize total path (2)'!C13,Items!$H$3:$H$17,0))","v":107},{"$f":"INDEX(Items!$J$3:$J$17,MATCH('Optimize total path (2)'!C13,Items!$H$3:$H$17,0))","v":26}]
[null,1,{"$f":"INDEX(Items!$H$4:$H$17,MATCH('Optimize total path (2)'!B14,Items!$G$4:$G$17,0))","v":539},{"$f":"INDEX(Paths!$C$3:$Q$17,MATCH('Optimize total path (2)'!C13,Paths!$B$3:$B$17,0),MATCH('Optimize total path (2)'!C14,Paths!$C$2:$Q$2,0))","v":35.071067811865476},{"$f":"INDEX(Items!$I$3:$I$17,MATCH('Optimize total path (2)'!C14,Items!$H$3:$H$17,0))","v":73},{"$f":"INDEX(Items!$J$3:$J$17,MATCH('Optimize total path (2)'!C14,Items!$H$3:$H$17,0))","v":22}]
[null,4,{"$f":"INDEX(Items!$H$4:$H$17,MATCH('Optimize total path (2)'!B15,Items!$G$4:$G$17,0))","v":2091},{"$f":"INDEX(Paths!$C$3:$Q$17,MATCH('Optimize total path (2)'!C14,Paths!$B$3:$B$17,0),MATCH('Optimize total path (2)'!C15,Paths!$C$2:$Q$2,0))","v":55.242640687119284},{"$f":"INDEX(Items!$I$3:$I$17,MATCH('Optimize total path (2)'!C15,Items!$H$3:$H$17,0))","v":65},{"$f":"INDEX(Items!$J$3:$J$17,MATCH('Optimize total path (2)'!C15,Items!$H$3:$H$17,0))","v":47}]
[null,5,{"$f":"INDEX(Items!$H$4:$H$17,MATCH('Optimize total path (2)'!B16,Items!$G$4:$G$17,0))","v":3054},{"$f":"INDEX(Paths!$C$3:$Q$17,MATCH('Optimize total path (2)'!C15,Paths!$B$3:$B$17,0),MATCH('Optimize total path (2)'!C16,Paths!$C$2:$Q$2,0))","v":38.656854249492383},{"$f":"INDEX(Items!$I$3:$I$17,MATCH('Optimize total path (2)'!C16,Items!$H$3:$H$17,0))","v":68},{"$f":"INDEX(Items!$J$3:$J$17,MATCH('Optimize total path (2)'!C16,Items!$H$3:$H$17,0))","v":63}]
[null,7,{"$f":"INDEX(Items!$H$4:$H$17,MATCH('Optimize total path (2)'!B17,Items!$G$4:$G$17,0))","v":4124},{"$f":"INDEX(Paths!$C$3:$Q$17,MATCH('Optimize total path (2)'!C16,Paths!$B$3:$B$17,0),MATCH('Optimize total path (2)'!C17,Paths!$C$2:$Q$2,0))","v":32.071067811865476},{"$f":"INDEX(Items!$I$3:$I$17,MATCH('Optimize total path (2)'!C17,Items!$H$3:$H$17,0))","v":58},{"$f":"INDEX(Items!$J$3:$J$17,MATCH('Optimize total path (2)'!C17,Items!$H$3:$H$17,0))","v":82}]
[null,0,"Start",{"$f":"INDEX(Paths!$C$3:$Q$17,MATCH('Optimize total path (2)'!C17,Paths!$B$3:$B$17,0),MATCH('Optimize total path (2)'!C18,Paths!$C$2:$Q$2,0))","v":59.14213562373093},{"$f":"INDEX(Items!$I$3:$I$17,MATCH('Optimize total path (2)'!C18,Items!$H$3:$H$17,0))","v":2},{"$f":"INDEX(Items!$J$3:$J$17,MATCH('Optimize total path (2)'!C18,Items!$H$3:$H$17,0))","v":89}]
[null,null,"Total distance:",{"$f":"SUM(D3:D18)","v":661.23759005323598}]