{"text_format":"1","workbook":"xlsx","n_sheets":4,"sheets":["Excel 365","prev versions","VBA macro","example"],"not_rendered":{"charts":0,"images":0,"macros":1,"external_links":0,"defined_names":0,"comments":0,"pivot_tables":0},"unopened":[],"bounds":{"document_bytes":16777216,"sheet_cells":100000,"rows_first":2000,"rows_last":500,"rows_between":2000,"halvings":0,"cell_chars":16384,"cell_head_chars":4096},"cells_cut":0,"cells_raw":0,"read":"whole","date_system":"1900"}

{"sheet":"Excel 365","index":0,"n_rows":12,"n_cols":12,"rows_kept":12,"cut":false,"hidden":false,"merged":[]}
[]
[null,"#","Color","Size","Code","Price",null,"#","Color","Size","Code","Price"]
[null,1,"Blue","Large","AA-11",10,null,{"$f":"INDEX($B$3:$F$12,_xlfn.SEQUENCE(ROUNDUP(ROWS($B$3:$F$12)/3,0),,,3),_xlfn.SEQUENCE(,COLUMNS($B$3:$F$12)))","v":1},"Blue","Large","AA-11",10]
[null,2,"Brown","Small","AA-12",70,null,4,"Blue","Small","AA-14",15]
[null,3,"White","Small","AA-13",90,null,7,"Yellow","Small","AA-17",30]
[null,4,"Blue","Small","AA-14",15,null,10,"Brown","Large","AA-20",40]
[null,5,"Green","Large","AA-15",20]
[null,6,"Green","Large","AA-16",10]
[null,7,"Yellow","Small","AA-17",30]
[null,8,"Blue","Large","AA-18",50]
[null,9,"Pink","Large","AA-19",80]
[null,10,"Brown","Large","AA-20",40]

{"sheet":"prev versions","index":1,"n_rows":12,"n_cols":20,"rows_kept":12,"cut":false,"hidden":false,"merged":[]}
[]
[null,"#","Color","Size","Code","Price",null,"#","Color","Size","Code","Price"]
[null,1,"Blue","Large","AA-11",10,null,{"$f":"INDEX($B$3:$F$12,ROWS($A$1:A1)*2-1,COLUMNS($A$1:A1))","v":1},{"$f":"INDEX($B$3:$F$12,ROWS($A$1:B1)*2-1,COLUMNS($A$1:B1))","v":"Blue"},{"$f":"INDEX($B$3:$F$12,ROWS($A$1:C1)*2-1,COLUMNS($A$1:C1))","v":"Large"},{"$f":"INDEX($B$3:$F$12,ROWS($A$1:D1)*2-1,COLUMNS($A$1:D1))","v":"AA-11"},{"$f":"INDEX($B$3:$F$12,ROWS($A$1:E1)*2-1,COLUMNS($A$1:E1))","v":10},null,null,null,null,null,{"$f":"ROWS($A$1:A1)*2-1","v":1},{"$f":"ROWS($A$1:A1)*3-2","v":1},{"$f":"ROWS($A$1:A1)*4-3","v":1}]
[null,2,"Brown","Small","AA-12",70,null,{"$f":"INDEX($B$3:$F$12,ROWS($A$1:A2)*2-1,COLUMNS($A$1:A2))","v":3},{"$f":"INDEX($B$3:$F$12,ROWS($A$1:B2)*2-1,COLUMNS($A$1:B2))","v":"White"},{"$f":"INDEX($B$3:$F$12,ROWS($A$1:C2)*2-1,COLUMNS($A$1:C2))","v":"Small"},{"$f":"INDEX($B$3:$F$12,ROWS($A$1:D2)*2-1,COLUMNS($A$1:D2))","v":"AA-13"},{"$f":"INDEX($B$3:$F$12,ROWS($A$1:E2)*2-1,COLUMNS($A$1:E2))","v":90},null,null,null,null,null,{"$f":"ROWS($A$1:A2)*2-1","v":3},{"$f":"ROWS($A$1:A2)*3-2","v":4},{"$f":"ROWS($A$1:A2)*4-3","v":5}]
[null,3,"White","Small","AA-13",90,null,{"$f":"INDEX($B$3:$F$12,ROWS($A$1:A3)*2-1,COLUMNS($A$1:A3))","v":5},{"$f":"INDEX($B$3:$F$12,ROWS($A$1:B3)*2-1,COLUMNS($A$1:B3))","v":"Green"},{"$f":"INDEX($B$3:$F$12,ROWS($A$1:C3)*2-1,COLUMNS($A$1:C3))","v":"Large"},{"$f":"INDEX($B$3:$F$12,ROWS($A$1:D3)*2-1,COLUMNS($A$1:D3))","v":"AA-15"},{"$f":"INDEX($B$3:$F$12,ROWS($A$1:E3)*2-1,COLUMNS($A$1:E3))","v":20},null,null,null,null,null,{"$f":"ROWS($A$1:A3)*2-1","v":5},{"$f":"ROWS($A$1:A3)*3-2","v":7},{"$f":"ROWS($A$1:A3)*4-3","v":9}]
[null,4,"Blue","Small","AA-14",15,null,{"$f":"INDEX($B$3:$F$12,ROWS($A$1:A4)*2-1,COLUMNS($A$1:A4))","v":7},{"$f":"INDEX($B$3:$F$12,ROWS($A$1:B4)*2-1,COLUMNS($A$1:B4))","v":"Yellow"},{"$f":"INDEX($B$3:$F$12,ROWS($A$1:C4)*2-1,COLUMNS($A$1:C4))","v":"Small"},{"$f":"INDEX($B$3:$F$12,ROWS($A$1:D4)*2-1,COLUMNS($A$1:D4))","v":"AA-17"},{"$f":"INDEX($B$3:$F$12,ROWS($A$1:E4)*2-1,COLUMNS($A$1:E4))","v":30},null,null,null,null,null,{"$f":"ROWS($A$1:A4)*2-1","v":7},{"$f":"ROWS($A$1:A4)*3-2","v":10},{"$f":"ROWS($A$1:A4)*4-3","v":13}]
[null,5,"Green","Large","AA-15",20,null,{"$f":"INDEX($B$3:$F$12,ROWS($A$1:A5)*2-1,COLUMNS($A$1:A5))","v":9},{"$f":"INDEX($B$3:$F$12,ROWS($A$1:B5)*2-1,COLUMNS($A$1:B5))","v":"Pink"},{"$f":"INDEX($B$3:$F$12,ROWS($A$1:C5)*2-1,COLUMNS($A$1:C5))","v":"Large"},{"$f":"INDEX($B$3:$F$12,ROWS($A$1:D5)*2-1,COLUMNS($A$1:D5))","v":"AA-19"},{"$f":"INDEX($B$3:$F$12,ROWS($A$1:E5)*2-1,COLUMNS($A$1:E5))","v":80},null,null,null,null,null,{"$f":"ROWS($A$1:A5)*2-1","v":9},{"$f":"ROWS($A$1:A5)*3-2","v":13},{"$f":"ROWS($A$1:A5)*4-3","v":17}]
[null,6,"Green","Large","AA-16",10,null,null,null,null,null,null,null,null,null,null,null,{"$f":"ROWS($A$1:A6)*2-1","v":11},{"$f":"ROWS($A$1:A6)*3-2","v":16},{"$f":"ROWS($A$1:A6)*4-3","v":21}]
[null,7,"Yellow","Small","AA-17",30,null,null,null,null,null,null,null,null,null,null,null,{"$f":"ROWS($A$1:A7)*2-1","v":13},{"$f":"ROWS($A$1:A7)*3-2","v":19},{"$f":"ROWS($A$1:A7)*4-3","v":25}]
[null,8,"Blue","Large","AA-18",50,null,null,null,null,null,null,null,null,null,null,null,{"$f":"ROWS($A$1:A8)*2-1","v":15},{"$f":"ROWS($A$1:A8)*3-2","v":22},{"$f":"ROWS($A$1:A8)*4-3","v":29}]
[null,9,"Pink","Large","AA-19",80]
[null,10,"Brown","Large","AA-20",40]

{"sheet":"VBA macro","index":2,"n_rows":12,"n_cols":6,"rows_kept":12,"cut":false,"hidden":false,"merged":[]}
[]
[null,"#","Color","Size","Code","Price"]
[null,1,"Blue","Large","AA-11",10]
[null,2,"Brown","Small","AA-12",70]
[null,3,"White","Small","AA-13",90]
[null,4,"Blue","Small","AA-14",15]
[null,5,"Green","Large","AA-15",20]
[null,6,"Green","Large","AA-16",10]
[null,7,"Yellow","Small","AA-17",30]
[null,8,"Blue","Large","AA-18",50]
[null,9,"Pink","Large","AA-19",80]
[null,10,"Brown","Large","AA-20",40]

{"sheet":"example","index":3,"n_rows":13,"n_cols":7,"rows_kept":13,"cut":false,"hidden":false,"merged":[]}
[]
[null,null,1,2,3,4,5]
[null,null,"#","Color","Size","Code","Price"]
[null,1,1,"Blue","Large","AA-11",10]
[null,2,2,"Brown","Small","AA-12",70]
[null,3,3,"White","Small","AA-13",90]
[null,4,4,"Blue","Small","AA-14",15]
[null,5,5,"Green","Large","AA-15",20]
[null,6,6,"Green","Large","AA-16",10]
[null,7,7,"Yellow","Small","AA-17",30]
[null,8,8,"Blue","Large","AA-18",50]
[null,9,9,"Pink","Large","AA-19",80]
[null,10,10,"Brown","Large","AA-20",40]